{"text_format":"1","workbook":"xlsx","n_sheets":11,"sheets":["TEU2EXP","Identify Toxic Emitting Units","Identify Toxic Air Contaminants","Identify Exposure Locations","Calculate Dispersion Factors","Calculate Risk","Summarize Risk","RBCs","TACs","Dispersion Factors","Errata"],"not_rendered":{"charts":0,"images":1,"macros":1,"external_links":31,"defined_names":717,"comments":0,"pivot_tables":0},"unopened":[],"bounds":{"document_bytes":16777216,"sheet_cells":100000,"rows_first":2000,"rows_last":500,"rows_between":2000,"halvings":0,"cell_chars":16384,"cell_head_chars":4096},"cells_cut":0,"cells_raw":0,"read":"whole","date_system":"1900"}

{"sheet":"TEU2EXP","index":0,"n_rows":23,"n_cols":18,"rows_kept":23,"cut":false,"hidden":false,"merged":[[7,5,7,9]]}
[]
[]
[]
[]
[]
[]
[]
[null,null,null,null,null,"Distance from TEU to Receptor (m)"]
[null,null,null,null,"Recp ID","R1","DayC1","DayC2","W1","W2"]
[null,null,null,null,"UTM X",538448.33959999902,538360.827697,538620.03582285799,538469.49399999902,538372.18939999898]
[null,"TEI UD",null,null,"UTM Y",5044380.5963000003,5044295.2069579996,5044324.6861773403,5044767.2670999998,5044768.1376999998]
[null,"ID","MOD ID","UTM X","UTM Y"]
[null,"DC-1","EU2DC",538423,5044774,{"$f":"SQRT(($D13-F$10)^2+($E13-F$11)^2)","v":394.21893219573383},{"$f":"SQRT(($D13-G$10)^2+($E13-G$11)^2)","v":482.81277150496379},490.61800489012182,46.978973789568201,51.14766498829654]
[null,"EU-3","EU3CLF",538428,5044770,389.93453412278967,479.52116848195692,484.95583088824327,41.583900470366565,55.841662168706485]
[null,"EU-4A","EU4APV",538425,5044771,391.10073625800101,480.10113860342187,487.06775760152061,44.650314425811231,52.888110514161475]
{"$rows_left_out":9}
{"sheet":"Identify Toxic Emitting Units","index":1,"n_rows":11,"n_cols":8,"rows_kept":11,"cut":false,"hidden":false,"merged":[[4,3,5,3],[4,2,5,2],[4,1,5,1],[4,4,5,4]]}
[]
[null,"Toxic Emission Units (TEUs)"]
[]
[]
[null,"TEU Identifier","Description","Emission Type","Number of TACs at TEU","Stack Height","Building Area","Building Height"]
[null,null,null,null,null,"m","ft^2","ft"]
[null,"EU-2","Polishing Dust Collector","Point",15,{"$f":"CONVERT(H8+10,\"ft\",\"m\")","v":10.759439999999998}]
[null,"EU-3","Cleaning Building Fugitive","Fugitive",2,null,27000,25.3]
[null,"EU-4A","Passivation Building Exhaust A","Point",1,{"$f":"76/12/3.281","v":1.9303058010769072}]
[null,"EU-4B","Passivation Building Exhaust B","Point",1,{"$f":"86/12/3.281","v":2.1842934064817636}]
[null,"CIA-1","Diesel-fired Emergency Generator","Point",50,3]

{"sheet":"Identify Toxic Air Contaminants","index":2,"n_rows":75,"n_cols":6,"rows_kept":75,"cut":false,"hidden":false,"merged":[[4,3,5,3],[4,1,5,1],[4,2,5,2]]}
[]
[null,"Toxic Air Contaminents and Emission Rates"]
[]
[]
[null,"TEU Identifier","TAC","CAS Number","Annual Emissions","Daily Max Emissions"]
[null,null,null,null,"lb/yr","lb/day"]
[null,"EU-2","Arsenic and compounds",{"$f":"_xlfn.IFNA(IF(VLOOKUP(C7,TACcas,3,FALSE)=\"NoRBC\",\"NoRBC\",VLOOKUP(C7,TACcas,2,FALSE)),\"NoRBC\")","v":"7440-38-2"},1.2614400000000002E-3,3.4560000000000005E-6]
[null,"EU-2","Barium and compounds","NoRBC",9.8512457142857141E-2,2.6989714285714284E-4]
[null,"EU-2","Cadmium and compounds","7440-43-9",2.5228800000000003E-4,6.9120000000000005E-7]
[null,"EU-2","Chromium VI, chromate and dichromate particulate","18540-29-9",4.3850057142857148E-3,1.2013714285714286E-5]
[null,"EU-2","Lead and compounds","7439-92-1",6.7757348571428574E-4,1.8563657142857142E-6]
[null,"EU-2","Mercury and compounds","7439-97-6",1.019964342857143E-4,2.7944228571428573E-7]
[null,"EU-2","Selenium and compounds","7782-49-2",1.2614400000000002E-3,3.4560000000000005E-6]
[null,"EU-2","Silver and compounds","NoRBC",2.5228800000000003E-4,6.9120000000000005E-7]
[null,"EU-2","Molybdenum trioxide","NoRBC",0.43614327910072209,1.1949130934266359E-3]
{"$rows_left_out":61}
{"sheet":"Identify Exposure Locations","index":3,"n_rows":11,"n_cols":10,"rows_kept":11,"cut":false,"hidden":false,"merged":[]}
[]
[null,"Exposure Locations"]
[null,"A map with the TEI and each Exposure Location labeled should be included with the submission."]
[]
[]
[null,"TEU Identifier","Residential Exposure Name","Distance (m)","Child Exposure Name","Distance (m)","Work Exposure Name","Distance (m)","Acute Exposure Name","Distance (m)"]
[null,"EU-2","R1",394.21893219573383,"DayC1",482.81277150496379,"W1",46.978973789568201,"W1",46.978973789568201]
[null,"EU-3","R1",389.93453412278967,"DayC1",479.52116848195692,"W2",41.583900470366565,"W2",41.583900470366565]
[null,"EU-4A","R1",391.10073625800101,"DayC1",480.10113860342187,"W2",44.650314425811231,"W2",44.650314425811231]
[null,"EU-4B","R1",391.65957093059114,"DayC1",479.09742896440395,"W2",44.901922383589628,"W2",44.901922383589628]
[null,"CIA-1","R1",395.27987135141029,"DayC2",478.64183638025554,"W2",12.855201141654483,"W2",12.855201141654483]

{"sheet":"Calculate Dispersion Factors","index":4,"n_rows":11,"n_cols":7,"rows_kept":11,"cut":false,"hidden":false,"merged":[[4,2,5,2],[4,1,5,1]]}
[]
[null,"Dispersion Factors"]
[]
[]
[null,"TEU","Type","DF Residential ","DF Child","DF Worker","DF Acute"]
[null,null,null,"ug/m3/lbs/yr","ug/m3/lbs/yr","ug/m3/lbs/yr","ug/m3/lbs/yr"]
[null,"EU-2","Point",9.9158140946734036E-5,6.7644786628143975E-5,1.3012728000000003E-3,3.4962240000000007]
[null,"EU-3","Fugitive",1.360392795263262E-4,9.1734072825052059E-5,3.3999999999999998E-3,2.9]
[null,"EU-4A","Point",1.0533955824519939E-4,7.6173703963110316E-5,3.3E-3,8.3000000000000007]
[null,"EU-4B","Point",1.0500425744164531E-4,7.6434668469254973E-5,3.3E-3,8.3000000000000007]
[null,"CIA-1","Point",1.0283207718915383E-4,7.6553122541133555E-5,3.3E-3,8.3000000000000007]

{"sheet":"Calculate Risk","index":5,"n_rows":75,"n_cols":18,"rows_kept":75,"cut":false,"hidden":false,"merged":[[4,17,5,17],[4,7,4,9],[4,10,5,10],[4,4,4,6],[4,1,5,1],[4,2,5,2],[4,3,5,3],[4,11,4,13],[4,14,4,16]]}
[]
[null,"Risk Calculations"]
[]
[]
[null,"TEU Identifier","TAC","CAS Number","Cancer RBC",null,null,"Chronic RBC",null,null,"Acute RBC","Cancer Risk",null,null,"Chronic Risk",null,null,"Acute"]
[null,null,null,null,"Residential","Child","Worker","Residential","Child","Worker",null,"Residential","Child","Worker","Residential","Child","Worker"]
[null,"EU-2","Arsenic and compounds","7440-38-2",2.4000000000000001E-5,1.2999999999999999E-3,6.2E-4,1.7000000000000001E-4,2.3999999999999998E-3,2.3999999999999998E-3,0.2,{"$f":"'Identify Toxic Air Contaminants'!$E7*VLOOKUP($B7,'Calculate Dispersion Factors'!$B$7:$N$11,3,FALSE)/E7","v":5.211751888160341E-3},{"$f":"'Identify Toxic Air Contaminants'!$E7*VLOOKUP($B7,'Calculate Dispersion Factors'!$B$7:$N$11,4,FALSE)/F7","v":6.5638338187850741E-5},{"$f":"'Identify Toxic Air Contaminants'!$E7*VLOOKUP($B7,'Calculate Dispersion Factors'!$B$7:$N$11,5,FALSE)/G7","v":2.6475444529548398E-3},{"$f":"'Identify Toxic Air Contaminants'!$E7*VLOOKUP($B7,'Calculate Dispersion Factors'!$B$7:$N$11,3,FALSE)/H7","v":7.3577673715204811E-4},{"$f":"'Identify Toxic Air Contaminants'!$E7*VLOOKUP($B7,'Calculate Dispersion Factors'!$B$7:$N$11,4,FALSE)/I7","v":3.5554099851752482E-5},{"$f":"'Identify Toxic Air Contaminants'!$E7*VLOOKUP($B7,'Calculate Dispersion Factors'!$B$7:$N$11,5,FALSE)/J7","v":6.8394898368000028E-4},{"$f":"'Identify Toxic Air Contaminants'!$F7*VLOOKUP($B7,'Calculate Dispersion Factors'!$B$7:$N$11,6,FALSE)/K7","v":6.0414750720000014E-5}]
[null,"EU-2","Barium and compounds","NoRBC","--","--","--","--","--","--","--"]
[null,"EU-2","Cadmium and compounds","7440-43-9",5.5999999999999995E-4,1.4E-2,6.7000000000000002E-3,5.0000000000000001E-3,3.6999999999999998E-2,3.6999999999999998E-2,0.03,{"$f":"'Identify Toxic Air Contaminants'!$E9*VLOOKUP($B9,'Calculate Dispersion Factors'!$B$7:$N$11,3,FALSE)/E9","v":4.4672159041374365E-5},{"$f":"'Identify Toxic Air Contaminants'!$E9*VLOOKUP($B9,'Calculate Dispersion Factors'!$B$7:$N$11,4,FALSE)/F9","v":1.2189977092029423E-6},{"$f":"'Identify Toxic Air Contaminants'!$E9*VLOOKUP($B9,'Calculate Dispersion Factors'!$B$7:$N$11,5,FALSE)/G9","v":4.8999330174089569E-5},{"$f":"'Identify Toxic Air Contaminants'!$E9*VLOOKUP($B9,'Calculate Dispersion Factors'!$B$7:$N$11,3,FALSE)/H9","v":5.0032818126339285E-6},{"$f":"'Identify Toxic Air Contaminants'!$E9*VLOOKUP($B9,'Calculate Dispersion Factors'!$B$7:$N$11,4,FALSE)/I9","v":4.6124237645516735E-7},{"$f":"'Identify Toxic Air Contaminants'!$E9*VLOOKUP($B9,'Calculate Dispersion Factors'!$B$7:$N$11,5,FALSE)/J9","v":8.8728516801729762E-6},{"$f":"'Identify Toxic Air Contaminants'!$F9*VLOOKUP($B9,'Calculate Dispersion Factors'!$B$7:$N$11,6,FALSE)/K9","v":8.0553000960000023E-5}]
[null,"EU-2","Chromium VI, chromate and dichromate particulate","18540-29-9",3.1000000000000001E-5,5.1999999999999995E-4,1E-3,8.3000000000000004E-2,0.88,0.88,0.3,{"$f":"'Identify Toxic Air Contaminants'!$E10*VLOOKUP($B10,'Calculate Dispersion Factors'!$B$7:$N$11,3,FALSE)/E10","v":1.4026097247399259E-2},{"$f":"'Identify Toxic Air Contaminants'!$E10*VLOOKUP($B10,'Calculate Dispersion Factors'!$B$7:$N$11,4,FALSE)/F10","v":5.7042841520394088E-4},{"$f":"'Identify Toxic Air Contaminants'!$E10*VLOOKUP($B10,'Calculate Dispersion Factors'!$B$7:$N$11,5,FALSE)/G10","v":5.7060886638445737E-3},{"$f":"'Identify Toxic Air Contaminants'!$E10*VLOOKUP($B10,'Calculate Dispersion Factors'!$B$7:$N$11,3,FALSE)/H10","v":5.2386628273418916E-6},{"$f":"'Identify Toxic Air Contaminants'!$E10*VLOOKUP($B10,'Calculate Dispersion Factors'!$B$7:$N$11,4,FALSE)/I10","v":3.3707133625687414E-7},{"$f":"'Identify Toxic Air Contaminants'!$E10*VLOOKUP($B10,'Calculate Dispersion Factors'!$B$7:$N$11,5,FALSE)/J10","v":6.4841916634597428E-6},{"$f":"'Identify Toxic Air Contaminants'!$F10*VLOOKUP($B10,'Calculate Dispersion Factors'!$B$7:$N$11,6,FALSE)/K10","v":1.4000878738285719E-4}]
[null,"EU-2","Lead and compounds","7439-92-1","--","--","--",0.15,0.66,0.66,0.15,"--","--","--",{"$f":"'Identify Toxic Air Contaminants'!$E11*VLOOKUP($B11,'Calculate Dispersion Factors'!$B$7:$N$11,3,FALSE)/H11","v":4.4791284798818018E-7},{"$f":"'Identify Toxic Air Contaminants'!$E11*VLOOKUP($B11,'Calculate Dispersion Factors'!$B$7:$N$11,4,FALSE)/I11","v":6.9445930100046393E-8},{"$f":"'Identify Toxic Air Contaminants'!$E11*VLOOKUP($B11,'Calculate Dispersion Factors'!$B$7:$N$11,5,FALSE)/J11","v":1.335921131759377E-6},{"$f":"'Identify Toxic Air Contaminants'!$F11*VLOOKUP($B11,'Calculate Dispersion Factors'!$B$7:$N$11,6,FALSE)/K11","v":4.3268469087085723E-5}]
[null,"EU-2","Mercury and compounds","7439-97-6","--","--","--",7.6999999999999999E-2,0.63,0.63,0.6,"--","--","--",{"$f":"'Identify Toxic Air Contaminants'!$E12*VLOOKUP($B12,'Calculate Dispersion Factors'!$B$7:$N$11,3,FALSE)/H12","v":1.3134775073983318E-7},{"$f":"'Identify Toxic Air Contaminants'!$E12*VLOOKUP($B12,'Calculate Dispersion Factors'!$B$7:$N$11,4,FALSE)/I12","v":1.0951630212839131E-8},{"$f":"'Identify Toxic Air Contaminants'!$E12*VLOOKUP($B12,'Calculate Dispersion Factors'!$B$7:$N$11,5,FALSE)/J12","v":2.1067489783013887E-7},{"$f":"'Identify Toxic Air Contaminants'!$F12*VLOOKUP($B12,'Calculate Dispersion Factors'!$B$7:$N$11,6,FALSE)/K12","v":1.628321376548572E-6}]
[null,"EU-2","Selenium and compounds","7782-49-2","--","--","--","--","--","--",2,"--","--","--","--","--","--",{"$f":"'Identify Toxic Air Contaminants'!$F13*VLOOKUP($B13,'Calculate Dispersion Factors'!$B$7:$N$11,6,FALSE)/K13","v":6.0414750720000016E-6}]
[null,"EU-2","Silver and compounds","NoRBC","--","--","--","--","--","--","--"]
[null,"EU-2","Molybdenum trioxide","NoRBC","--","--","--","--","--","--","--"]
{"$rows_left_out":61}
{"sheet":"Summarize Risk","index":6,"n_rows":12,"n_cols":9,"rows_kept":12,"cut":false,"hidden":false,"merged":[[4,2,4,4],[4,5,4,7],[4,8,5,8],[4,1,5,1]]}
[]
[null,"Summary of Risk"]
[]
[]
[null,"TEU Identifier","Cancer Risk",null,null,"Chronic Risk",null,null,"Acute"]
[null,null,"Residential","Child","Worker","Residential","Child","Worker"]
[null,"EU-2",{"$f":"SUMIF('Calculate Risk'!$B$7:$B$75,$B7,'Calculate Risk'!L$7:L$75)","v":1.9429234069557908E-2},{"$f":"SUMIF('Calculate Risk'!$B$7:$B$75,$B7,'Calculate Risk'!M$7:M$75)","v":6.4108902395370779E-4},{"$f":"SUMIF('Calculate Risk'!$B$7:$B$75,$B7,'Calculate Risk'!N$7:N$75)","v":8.5616824466566033E-3},{"$f":"SUMIF('Calculate Risk'!$B$7:$B$75,$B7,'Calculate Risk'!O$7:O$75)","v":4.3093127699938656E-3},{"$f":"SUMIF('Calculate Risk'!$B$7:$B$75,$B7,'Calculate Risk'!P$7:P$75)","v":5.8851186894011279E-4},{"$f":"SUMIF('Calculate Risk'!$B$7:$B$75,$B7,'Calculate Risk'!Q$7:Q$75)","v":1.1321116167292521E-2},{"$f":"SUMIF('Calculate Risk'!$B$7:$B$75,$B7,'Calculate Risk'!R$7:R$75)","v":4.3370999631807641E-2}]
[null,"EU-3",{"$f":"SUMIF('Calculate Risk'!$B$7:$B$75,$B8,'Calculate Risk'!L$7:L$75)","v":0},{"$f":"SUMIF('Calculate Risk'!$B$7:$B$75,$B8,'Calculate Risk'!M$7:M$75)","v":0},{"$f":"SUMIF('Calculate Risk'!$B$7:$B$75,$B8,'Calculate Risk'!N$7:N$75)","v":0},{"$f":"SUMIF('Calculate Risk'!$B$7:$B$75,$B8,'Calculate Risk'!O$7:O$75)","v":3.3615956765315003E-3},{"$f":"SUMIF('Calculate Risk'!$B$7:$B$75,$B8,'Calculate Risk'!P$7:P$75)","v":5.1509462256345328E-4},{"$f":"SUMIF('Calculate Risk'!$B$7:$B$75,$B8,'Calculate Risk'!Q$7:Q$75)","v":1.909128923181818E-2},{"$f":"SUMIF('Calculate Risk'!$B$7:$B$75,$B8,'Calculate Risk'!R$7:R$75)","v":2.5650800027618204E-2}]
[null,"EU-4A",{"$f":"SUMIF('Calculate Risk'!$B$7:$B$75,$B9,'Calculate Risk'!L$7:L$75)","v":0},{"$f":"SUMIF('Calculate Risk'!$B$7:$B$75,$B9,'Calculate Risk'!M$7:M$75)","v":0},{"$f":"SUMIF('Calculate Risk'!$B$7:$B$75,$B9,'Calculate Risk'!N$7:N$75)","v":0},{"$f":"SUMIF('Calculate Risk'!$B$7:$B$75,$B9,'Calculate Risk'!O$7:O$75)","v":0},{"$f":"SUMIF('Calculate Risk'!$B$7:$B$75,$B9,'Calculate Risk'!P$7:P$75)","v":0},{"$f":"SUMIF('Calculate Risk'!$B$7:$B$75,$B9,'Calculate Risk'!Q$7:Q$75)","v":0},{"$f":"SUMIF('Calculate Risk'!$B$7:$B$75,$B9,'Calculate Risk'!R$7:R$75)","v":5.4120489736534591E-3}]
[null,"EU-4B",{"$f":"SUMIF('Calculate Risk'!$B$7:$B$75,$B10,'Calculate Risk'!L$7:L$75)","v":0},{"$f":"SUMIF('Calculate Risk'!$B$7:$B$75,$B10,'Calculate Risk'!M$7:M$75)","v":0},{"$f":"SUMIF('Calculate Risk'!$B$7:$B$75,$B10,'Calculate Risk'!N$7:N$75)","v":0},{"$f":"SUMIF('Calculate Risk'!$B$7:$B$75,$B10,'Calculate Risk'!O$7:O$75)","v":0},{"$f":"SUMIF('Calculate Risk'!$B$7:$B$75,$B10,'Calculate Risk'!P$7:P$75)","v":0},{"$f":"SUMIF('Calculate Risk'!$B$7:$B$75,$B10,'Calculate Risk'!Q$7:Q$75)","v":0},{"$f":"SUMIF('Calculate Risk'!$B$7:$B$75,$B10,'Calculate Risk'!R$7:R$75)","v":1.4214173718873393E-2}]
[null,"CIA-1",{"$f":"SUMIF('Calculate Risk'!$B$7:$B$75,$B11,'Calculate Risk'!L$7:L$75)","v":1.7765945200163884E-2},{"$f":"SUMIF('Calculate Risk'!$B$7:$B$75,$B11,'Calculate Risk'!M$7:M$75)","v":4.9616895878290958E-4},{"$f":"SUMIF('Calculate Risk'!$B$7:$B$75,$B11,'Calculate Risk'!N$7:N$75)","v":4.5437045742815485E-2},{"$f":"SUMIF('Calculate Risk'!$B$7:$B$75,$B11,'Calculate Risk'!O$7:O$75)","v":4.7298344028641573E-4},{"$f":"SUMIF('Calculate Risk'!$B$7:$B$75,$B11,'Calculate Risk'!P$7:P$75)","v":6.4091638896005945E-5},{"$f":"SUMIF('Calculate Risk'!$B$7:$B$75,$B11,'Calculate Risk'!Q$7:Q$75)","v":2.7628188287574431E-3},{"$f":"SUMIF('Calculate Risk'!$B$7:$B$75,$B11,'Calculate Risk'!R$7:R$75)","v":5.8378496763476888E-3}]
[null,"Total Risk",{"$f":"SUM(C7:C11)","v":3.7195179269721795E-2},1.1372579827366174E-3,5.3998728189472087E-2,8.1438918868117823E-3,1.1676981303995722E-3,3.3175224227868144E-2,9.4485872028300388E-2]

{"sheet":"RBCs","index":7,"n_rows":265,"n_cols":10,"rows_kept":265,"cut":false,"hidden":false,"merged":[[1,1,3,1],[1,2,3,2],[1,3,1,4],[1,5,1,8],[1,0,3,0]]}
[]
[null,"CAS#","Chemical","Residential",null,"Non-Residential",null,null,null,"Acute "]
[null,null,null,"Cancer","Noncancer","Child Cancer","Child Noncancer","Worker Cancer","Worker Noncancer","Acute "]
[null,null,null,"(µg/m3)","(µg/m3)","(µg/m3)","(µg/m3)","(µg/m3)","(µg/m3)","(µg/m3)"]
[null,"75-07-0","Acetaldehyde",0.45,140,12,620,5.5,620,470]
[null,"60-35-5","Acetamide",0.05,"--",1.3,"--",0.6,"--","--"]
[null,"67-64-1","Acetone","--",31000,"--",140000,"--",140000,62000]
[null,"75-05-8","Acetonitrile","--",60,"--",260,"--",260,"--"]
[null,"107-02-8","Acrolein","--",0.35,"--",1.5,"--",1.5,6.9]
[null,"79-06-1","Acrylamide",5.8999999999999999E-3,6,6.2E-2,26,0.12,26,"--"]
[null,"79-10-7","Acrylic acid","--",1,"--",4.4000000000000004,"--",4.4000000000000004,6000]
[null,"107-13-1","Acrylonitrile",1.4999999999999999E-2,5,0.38,22,0.18,22,220]
[null,"309-00-2","Aldrin",2.0000000000000001E-4,"--",5.3E-3,"--",2.3999999999999998E-3,"--","--"]
[null,"107-05-1","Allyl chloride",0.17,1,4.3,4.4000000000000004,2,4.4000000000000004,"--"]
[null,"7429-90-5","Aluminum and compounds","--",5,"--",22,"--",22,"--"]
{"$rows_left_out":251}
{"sheet":"TACs","index":8,"n_rows":610,"n_cols":4,"rows_kept":610,"cut":false,"hidden":false,"merged":[]}
[]
[null,"Chemical","CAS#","RBC?"]
[null,"Acetaldehyde","75-07-0"]
[null,"Acetamide","60-35-5"]
[null,"Acetone","67-64-1"]
[null,"Acetonitrile","75-05-8"]
[null,"Acetophenone","98-86-2",{"$f":"IFERROR(VLOOKUP(C7,RBCs!$B$5:$C$265,2,FALSE),\"NoRBC\")","v":"NoRBC"}]
[null,"Acrolein","107-02-8"]
[null,"Acrylamide","79-06-1"]
[null,"Acrylic acid","79-10-7"]
[null,"Acrylonitrile","107-13-1"]
[null,"Actinomycin D","50-76-0",{"$f":"IFERROR(VLOOKUP(C12,RBCs!$B$5:$C$265,2,FALSE),\"NoRBC\")","v":"NoRBC"}]
[null,"Alar","1596-84-5",{"$f":"IFERROR(VLOOKUP(C13,RBCs!$B$5:$C$265,2,FALSE),\"NoRBC\")","v":"NoRBC"}]
[null,"Aldrin","309-00-2"]
[null,"Allyl chloride","107-05-1"]
{"$rows_left_out":596}
{"sheet":"Dispersion Factors","index":9,"n_rows":58,"n_cols":33,"rows_kept":58,"cut":false,"hidden":false,"merged":[[17,1,17,31],[0,1,0,31],[1,1,1,31],[2,1,2,31],[3,1,3,31],[4,6,4,31],[18,6,18,31],[31,1,31,32],[32,7,32,32],[45,1,45,32],[46,7,46,32]]}
[null,"OAR 340-245-8050 Table 5"]
[null,"Level 1 Risk Assessment Tool"]
[null,"Dispersion Factors"]
[null,"Table 5A: Stack Emission Dispersion Factors for Annual Exposure (µg/m3 / pounds/year)"]
[null,"Stack",null,null,null,null,"Exposure Location Distance (meters)"]
[null,"Ht (m)",10,20,30,40,50,60,70,80,90,100,110,120,130,140,150,160,170,180,190,200,250,300,350,400,450,500,600,700,800,1000]
[null,5,1.0999999999999999E-2,6.0000000000000001E-3,5.1999999999999998E-3,4.1000000000000003E-3,3.3E-3,2.5999999999999999E-3,2.0999999999999999E-3,1.6999999999999999E-3,1.4E-3,1.1999999999999999E-3,1E-3,8.8000000000000003E-4,7.6000000000000004E-4,6.6E-4,5.8E-4,5.1000000000000004E-4,4.6000000000000001E-4,4.0999999999999999E-4,3.6999999999999999E-4,3.4000000000000002E-4,2.3000000000000001E-4,1.7000000000000001E-4,1.2999999999999999E-4,1E-4,8.3999999999999995E-5,7.1000000000000005E-5,5.1999999999999997E-5,4.0000000000000003E-5,3.1999999999999999E-5,2.1999999999999999E-5]
[null,10,9.4999999999999998E-3,4.5999999999999999E-3,2.7000000000000001E-3,1.6000000000000001E-3,1.4E-3,1.1999999999999999E-3,1.1000000000000001E-3,9.3999999999999997E-4,8.4000000000000003E-4,7.5000000000000002E-4,6.8000000000000005E-4,6.2E-4,5.6999999999999998E-4,5.1999999999999995E-4,4.8000000000000001E-4,4.4000000000000002E-4,4.0999999999999999E-4,3.8000000000000002E-4,3.5E-4,3.3E-4,2.3000000000000001E-4,1.7000000000000001E-4,1.2999999999999999E-4,9.7999999999999997E-5,7.7999999999999999E-5,6.3999999999999997E-5,4.6999999999999997E-5,3.6000000000000001E-5,2.9E-5,2.0999999999999999E-5]
[null,15,4.3E-3,3.0000000000000001E-3,1.8E-3,1.2999999999999999E-3,7.5000000000000002E-4,6.0999999999999997E-4,5.4000000000000001E-4,4.8999999999999998E-4,4.4000000000000002E-4,4.0000000000000002E-4,3.6999999999999999E-4,3.4000000000000002E-4,3.1E-4,2.9E-4,2.7E-4,2.5000000000000001E-4,2.4000000000000001E-4,2.3000000000000001E-4,2.1000000000000001E-4,2.0000000000000001E-4,1.6000000000000001E-4,1.2999999999999999E-4,1E-4,8.2999999999999998E-5,6.8999999999999997E-5,5.7000000000000003E-5,4.1E-5,3.1999999999999999E-5,2.5000000000000001E-5,1.8E-5]
[null,20,2.3E-3,1.8E-3,1.2999999999999999E-3,8.8000000000000003E-4,7.2000000000000005E-4,5.4000000000000001E-4,3.5E-4,3.1E-4,2.7999999999999998E-4,2.5999999999999998E-4,2.3000000000000001E-4,2.2000000000000001E-4,2.0000000000000001E-4,1.9000000000000001E-4,1.7000000000000001E-4,1.6000000000000001E-4,1.4999999999999999E-4,1.3999999999999999E-4,1.3999999999999999E-4,1.2999999999999999E-4,1E-4,8.6000000000000003E-5,7.2999999999999999E-5,6.2000000000000003E-5,5.3000000000000001E-5,4.6E-5,3.4999999999999997E-5,2.6999999999999999E-5,2.0999999999999999E-5,1.5E-5]
[null,25,1.2999999999999999E-3,1.1000000000000001E-3,9.1E-4,6.6E-4,5.0000000000000001E-4,4.0999999999999999E-4,3.5E-4,2.5000000000000001E-4,1.9000000000000001E-4,1.8000000000000001E-4,1.6000000000000001E-4,1.4999999999999999E-4,1.3999999999999999E-4,1.2999999999999999E-4,1.2E-4,1.2E-4,1.1E-4,1E-4,9.6000000000000002E-5,9.1000000000000003E-5,7.2000000000000002E-5,5.8999999999999998E-5,5.1E-5,4.3999999999999999E-5,3.8999999999999999E-5,3.4E-5,2.6999999999999999E-5,2.1999999999999999E-5,1.8E-5,1.2999999999999999E-5]
[null,30,8.1999999999999998E-4,7.2999999999999996E-4,6.2E-4,5.0000000000000001E-4,3.6999999999999999E-4,2.9999999999999997E-4,2.5999999999999998E-4,2.3000000000000001E-4,1.9000000000000001E-4,1.2999999999999999E-4,1.2E-4,1.1E-4,1E-4,9.6000000000000002E-5,9.0000000000000006E-5,8.5000000000000006E-5,8.0000000000000007E-5,7.4999999999999993E-5,7.1000000000000005E-5,6.7999999999999999E-5,5.3000000000000001E-5,4.3999999999999999E-5,3.6999999999999998E-5,3.1999999999999999E-5,2.8E-5,2.5000000000000001E-5,2.0999999999999999E-5,1.7E-5,1.4E-5,1.0000000000000001E-5]
[null,35,5.2999999999999998E-4,4.8999999999999998E-4,4.2999999999999999E-4,3.6999999999999999E-4,2.9999999999999997E-4,2.3000000000000001E-4,1.9000000000000001E-4,1.7000000000000001E-4,1.4999999999999999E-4,1.2999999999999999E-4,1.1E-4,8.1000000000000004E-5,7.4999999999999993E-5,7.1000000000000005E-5,6.7999999999999999E-5,6.3999999999999997E-5,6.0999999999999999E-5,5.8E-5,5.5000000000000002E-5,5.1999999999999997E-5,4.1999999999999998E-5,3.4E-5,2.9E-5,2.5000000000000001E-5,2.1999999999999999E-5,1.9000000000000001E-5,1.5999999999999999E-5,1.4E-5,1.1E-5,8.4435308375617604E-6]
[null,40,3.6999999999999999E-4,3.4000000000000002E-4,3.1E-4,2.7E-4,2.3000000000000001E-4,1.9000000000000001E-4,1.4999999999999999E-4,1.2999999999999999E-4,1.2E-4,1.1E-4,9.6000000000000002E-5,8.1000000000000004E-5,6.3999999999999997E-5,5.3999999999999998E-5,5.1E-5,4.8999999999999998E-5,4.6999999999999997E-5,4.5000000000000003E-5,4.3000000000000002E-5,4.1E-5,3.3000000000000003E-5,2.8E-5,2.3E-5,2.0000000000000002E-5,1.8E-5,1.5999999999999999E-5,1.2999999999999999E-5,1.1E-5,9.3306957262908366E-6,7.0463861920172599E-6]
[null,45,2.7E-4,2.5000000000000001E-4,2.3000000000000001E-4,2.1000000000000001E-4,1.8000000000000001E-4,1.6000000000000001E-4,1.2999999999999999E-4,1.1E-4,9.5000000000000005E-5,8.5000000000000006E-5,7.7999999999999999E-5,7.2000000000000002E-5,6.3E-5,5.3000000000000001E-5,4.1999999999999998E-5,3.8000000000000002E-5,3.6999999999999998E-5,3.6000000000000001E-5,3.4E-5,3.3000000000000003E-5,2.6999999999999999E-5,2.3E-5,1.9000000000000001E-5,1.7E-5,1.5E-5,1.2999999999999999E-5,1.1E-5,8.9914292753738986E-6,7.8039420938378147E-6,5.9786441061701769E-6]
{"$rows_left_out":44}
{"sheet":"Errata","index":10,"n_rows":4,"n_cols":1,"rows_kept":4,"cut":false,"hidden":false,"merged":[]}
[]
[]
["11/12/21 - Modified zinc and nickel emission rates - parent metal only"]
["11/12/21 - Changed \"Nickel and Compounds\" to nickel compounds, soluble"]