{"text_format":"1","workbook":"xlsx","n_sheets":11,"sheets":["TEU2EXP","Identify Toxic Emitting Units","Identify Toxic Air Contaminants","Identify Exposure Locations","Calculate Dispersion Factors","Calculate Risk","Summarize Risk","RBCs","TACs","Dispersion Factors","Errata"],"not_rendered":{"charts":0,"images":1,"macros":1,"external_links":31,"defined_names":717,"comments":0,"pivot_tables":0},"unopened":[],"bounds":{"document_bytes":16777216,"sheet_cells":100000,"rows_first":2000,"rows_last":500,"rows_between":2000,"halvings":0,"cell_chars":16384,"cell_head_chars":4096},"cells_cut":0,"cells_raw":0,"read":"whole","date_system":"1900"}

{"sheet":"TEU2EXP","index":0,"n_rows":23,"n_cols":18,"rows_kept":23,"cut":false,"hidden":false,"merged":[[7,5,7,9]]}
[]
[]
[]
[]
[]
[]
[]
[null,null,null,null,null,"Distance from TEU to Receptor (m)"]
[null,null,null,null,"Recp ID","R1","DayC1","DayC2","W1","W2"]
[null,null,null,null,"UTM X",538448.33959999902,538360.827697,538620.03582285799,538469.49399999902,538372.18939999898]
[null,"TEI UD",null,null,"UTM Y",5044380.5963000003,5044295.2069579996,5044324.6861773403,5044767.2670999998,5044768.1376999998]
[null,"ID","MOD ID","UTM X","UTM Y"]
[null,"DC-1","EU2DC",538423,5044774,{"$f":"SQRT(($D13-F$10)^2+($E13-F$11)^2)","v":394.21893219573383},{"$f":"SQRT(($D13-G$10)^2+($E13-G$11)^2)","v":482.81277150496379},490.61800489012182,46.978973789568201,51.14766498829654]
[null,"EU-3","EU3CLF",538428,5044770,389.93453412278967,479.52116848195692,484.95583088824327,41.583900470366565,55.841662168706485]
[null,"EU-4A","EU4APV",538425,5044771,391.10073625800101,480.10113860342187,487.06775760152061,44.650314425811231,52.888110514161475]
[null,"EU-4B","EU4BPV",538417,5044771,391.65957093059114,479.09742896440395,490.32598713580484,52.626557728090773,44.901922383589628]
[null,"VP1","EU6VP",538446.83140000002,5044766.1832999997,385.58994960416544,478.76440098808581,474.25676738876683,22.688500636988106,74.667582279835017]
[null,"CIA","CIA1EG",538459.80000000005,5044775.71,395.27987135141029,490.59014475702531,478.64183638025554,12.855201141654483,87.937233069035614]
[null,null,null,null,null,null,null,null,null,null,null,null,"Source","Emission Point","Height(ft)","UTM X (m)","UTM Y (m)","Description"]
[null,null,null,null,null,null,null,null,null,null,null,null,{"$f":"'Identify Toxic Emitting Units'!C7","v":"Polishing Dust Collector"},{"$f":"'Identify Toxic Emitting Units'!B7","v":"EU-2"},{"$f":"MAX('Identify Toxic Emitting Units'!F7*3.281,'Identify Toxic Emitting Units'!H7)","v":35.301722639999994},{"$f":"D13","v":538423},5044774]
[null,null,null,null,null,null,null,null,null,null,null,null,{"$f":"'Identify Toxic Emitting Units'!C8","v":"Cleaning Building Fugitive"},{"$f":"'Identify Toxic Emitting Units'!B8","v":"EU-3"},{"$f":"MAX('Identify Toxic Emitting Units'!F8*3.281,'Identify Toxic Emitting Units'!H8)","v":25.3},538428,5044770]
[null,null,null,null,null,null,null,null,null,null,null,null,{"$f":"'Identify Toxic Emitting Units'!C9","v":"Passivation Building Exhaust A"},{"$f":"'Identify Toxic Emitting Units'!B9","v":"EU-4A"},1.93,538425,5044771]
[null,null,null,null,null,null,null,null,null,null,null,null,{"$f":"'Identify Toxic Emitting Units'!C10","v":"Passivation Building Exhaust B"},{"$f":"'Identify Toxic Emitting Units'!B10","v":"EU-4B"},2.1800000000000002,{"$f":"D18","v":538459.80000000005},{"$f":"E18","v":5044775.71}]

{"sheet":"Identify Toxic Emitting Units","index":1,"n_rows":11,"n_cols":8,"rows_kept":11,"cut":false,"hidden":false,"merged":[[4,3,5,3],[4,2,5,2],[4,1,5,1],[4,4,5,4]]}
[]
[null,"Toxic Emission Units (TEUs)"]
[]
[]
[null,"TEU Identifier","Description","Emission Type","Number of TACs at TEU","Stack Height","Building Area","Building Height"]
[null,null,null,null,null,"m","ft^2","ft"]
[null,"EU-2","Polishing Dust Collector","Point",15,{"$f":"CONVERT(H8+10,\"ft\",\"m\")","v":10.759439999999998}]
[null,"EU-3","Cleaning Building Fugitive","Fugitive",2,null,27000,25.3]
[null,"EU-4A","Passivation Building Exhaust A","Point",1,{"$f":"76/12/3.281","v":1.9303058010769072}]
[null,"EU-4B","Passivation Building Exhaust B","Point",1,{"$f":"86/12/3.281","v":2.1842934064817636}]
[null,"CIA-1","Diesel-fired Emergency Generator","Point",50,3]

{"sheet":"Identify Toxic Air Contaminants","index":2,"n_rows":75,"n_cols":6,"rows_kept":75,"cut":false,"hidden":false,"merged":[[4,3,5,3],[4,1,5,1],[4,2,5,2]]}
[]
[null,"Toxic Air Contaminents and Emission Rates"]
[]
[]
[null,"TEU Identifier","TAC","CAS Number","Annual Emissions","Daily Max Emissions"]
[null,null,null,null,"lb/yr","lb/day"]
[null,"EU-2","Arsenic and compounds",{"$f":"_xlfn.IFNA(IF(VLOOKUP(C7,TACcas,3,FALSE)=\"NoRBC\",\"NoRBC\",VLOOKUP(C7,TACcas,2,FALSE)),\"NoRBC\")","v":"7440-38-2"},1.2614400000000002E-3,3.4560000000000005E-6]
[null,"EU-2","Barium and compounds","NoRBC",9.8512457142857141E-2,2.6989714285714284E-4]
[null,"EU-2","Cadmium and compounds","7440-43-9",2.5228800000000003E-4,6.9120000000000005E-7]
[null,"EU-2","Chromium VI, chromate and dichromate particulate","18540-29-9",4.3850057142857148E-3,1.2013714285714286E-5]
[null,"EU-2","Lead and compounds","7439-92-1",6.7757348571428574E-4,1.8563657142857142E-6]
[null,"EU-2","Mercury and compounds","7439-97-6",1.019964342857143E-4,2.7944228571428573E-7]
[null,"EU-2","Selenium and compounds","7782-49-2",1.2614400000000002E-3,3.4560000000000005E-6]
[null,"EU-2","Silver and compounds","NoRBC",2.5228800000000003E-4,6.9120000000000005E-7]
[null,"EU-2","Molybdenum trioxide","NoRBC",0.43614327910072209,1.1949130934266359E-3]
[null,"EU-2","Nickel compounds, insoluble","365",5.6224182857142861E-3,1.5403885714285716E-5]
[null,"EU-2","Manganese and compounds","7439-96-5",0.15017142857142859,4.1142857142857149E-4]
[null,"EU-2","Aluminum and compounds","7429-90-5",3.1716205714285715,8.6893714285714296E-3]
[null,"EU-2","Cobalt and compounds","7440-48-4",0.15089225142857141,4.1340342857142852E-4]
[null,"EU-2","Phosphorus and compounds","NoRBC",0.12614400000000001,3.4560000000000005E-4]
[null,"EU-2","Vanadium (fume or dust)","7440-62-2",3.1716205714285715,8.6893714285714296E-3]
[null,"EU-3","Acetone","67-64-1",4947.7049999999999,27.110712328767125]
[null,"EU-3","Isopropyl alcohol","67-63-0",4910.1750000000002,26.905068493150686]
[null,"EU-4A","Nitric Acid","7697-37-2",20.467977985901452,5.6076652016168363E-2]
[null,"EU-4B","Nitric Acid","7697-37-2",53.756977474148883,0.14727939034013393]
[null,"CIA-1","1,3-Butadiene","106-99-0",0.17657228000000003,1.7657228000000002E-3]
[null,"CIA-1","2-Methyl naphthalene","NoRBC",9.9883604021322701E-3,9.9883604021322711E-5]
[null,"CIA-1","Acenaphthene","NoRBC",5.9665374092774737E-4,5.9665374092774745E-6]
[null,"CIA-1","Acenaphthylene","NoRBC",6.5773285817578939E-4,6.5773285817578937E-6]
[null,"CIA-1","Acetaldehyde","75-07-0",0.63619626000000007,6.3619626000000007E-3]
[null,"CIA-1","Acrolein","107-02-8",2.7533580000000002E-2,2.7533580000000003E-4]
[null,"CIA-1","Ammonia","7664-41-7",0.64976000000000012,6.4976000000000009E-3]
[null,"CIA-1","Anthracene","NoRBC",3.6718750561108159E-4,3.6718750561108157E-6]
[null,"CIA-1","Antimony and compounds","7440-36-0",2.5843170317003597E-4,2.5843170317003599E-6]
[null,"CIA-1","Arsenic and compounds","7440-38-2",2.2485974538242288E-4,2.2485974538242291E-6]
[null,"CIA-1","Barium and compounds","NoRBC",3.0367617837500743E-4,3.0367617837500742E-6]
[null,"CIA-1","Benz[a]anthracene","56-55-3",3.9425263110451316E-5,3.9425263110451321E-7]
[null,"CIA-1","Benzene","71-43-2",0.15131285999999999,1.5131286000000001E-3]
[null,"CIA-1","Benzo[a]pyrene",{"$f":"_xlfn.IFNA(IF(VLOOKUP(C39,TACcas,3,FALSE)=\"NoRBC\",\"NoRBC\",VLOOKUP(C39,TACcas,2,FALSE)),\"NoRBC\")","v":"50-32-8"},1.1683689779506015E-5,1.1683689779506016E-7]
[null,"CIA-1","Benzo[b]fluoranthene","205-99-2",3.6023976162013029E-5,3.6023976162013033E-7]
[null,"CIA-1","Benzo[e]pyrene","NoRBC",2.669562872583956E-5,2.6695628725839564E-7]
[null,"CIA-1","Benzo[g,h,i]perylene","191-24-2",1.7766305409257778E-5,1.7766305409257779E-7]
[null,"CIA-1","Benzo[k]fluoranthene","207-08-9",1.0602750353647415E-5,1.0602750353647417E-7]
[null,"CIA-1","Beryllium and compounds","7440-41-7",3.8748813458922843E-6,3.8748813458922843E-8]
[null,"CIA-1","Cadmium and compounds","7440-43-9",6.5608131833774338E-5,6.5608131833774343E-7]
[null,"CIA-1","Chlorobenzene","108-90-7",1.6244000000000002E-4,1.6244000000000003E-6]
[null,"CIA-1","Chromium VI, chromate and dichromate particulate","18540-29-9",5.1285930110301083E-5,5.1285930110301081E-7]
[null,"CIA-1","Chrysene","218-01-9",5.4417329466741362E-5,5.441732946674137E-7]
[null,"CIA-1","Cobalt and compounds","7440-48-4",1.279307410673193E-5,1.2793074106731929E-7]
[null,"CIA-1","Copper and compounds","7440-50-8",4.0783421614515075E-4,4.0783421614515079E-6]
[null,"CIA-1","Dibenz[a,h]anthracene","53-70-3",8.4224057171887565E-7,8.4224057171887564E-9]
[null,"CIA-1","Diesel particulate matter","200",13.787294557873409,0.13787294557873409]
[null,"CIA-1","Ethyl benzene","100-41-4",8.8529799999999999E-3,8.8529800000000007E-5]
[null,"CIA-1","Fluoranthene","206-44-0",3.0047603688595776E-4,3.0047603688595777E-6]
[null,"CIA-1","Fluorene","NoRBC",1.7741674693788317E-3,1.7741674693788318E-5]
[null,"CIA-1","Formaldehyde","50-00-0",2.2035495781504291,2.2035495781504291E-2]
[null,"CIA-1","Hexane","110-54-3",2.1848180000000002E-2,2.1848180000000003E-4]
[null,"CIA-1","Hydrochloric acid","7647-01-0",0.15131285999999999,1.5131286000000001E-3]
[null,"CIA-1","Indeno[1,2,3-cd]pyrene","193-39-5",8.6994527176594751E-6,8.699452717659476E-8]
[null,"CIA-1","Lead and compounds","7439-92-1",2.9537401812355967E-4,2.9537401812355969E-6]
[null,"CIA-1","Manganese and compounds","7439-96-5",3.4105305367176312E-4,3.4105305367176313E-6]
[null,"CIA-1","Mercury and compounds","7439-97-6",1.2270178733159498E-5,1.2270178733159498E-7]
[null,"CIA-1","Naphthalene","91-20-3",2.1403412062789787E-2,2.1403412062789788E-4]
[null,"CIA-1","Nickel compounds, insoluble","365",1.4800667102993331E-4,1.4800667102993332E-6]
[null,"CIA-1","Perylene","NoRBC",9.5697185069187352E-7,9.5697185069187358E-9]
[null,"CIA-1","Phenanthrene","NoRBC",3.6889689738184841E-3,3.688968973818484E-5]
[null,"CIA-1","Phosphorus and compounds","NoRBC",6.8257172109147807E-3,6.8257172109147809E-5]
[null,"CIA-1","Propylene","115-07-1",0.38173400000000002,3.8173400000000002E-3]
[null,"CIA-1","Pyrene","NoRBC",1.0152500000000001E-3,1.0152500000000001E-5]
[null,"CIA-1","Selenium and compounds","7782-49-2",3.0569801234434514E-4,3.0569801234434515E-6]
[null,"CIA-1","Silver and compounds",{"$f":"_xlfn.IFNA(IF(VLOOKUP(C71,TACcas,3,FALSE)=\"NoRBC\",\"NoRBC\",VLOOKUP(C71,TACcas,2,FALSE)),\"NoRBC\")","v":"NoRBC"},3.8996170147310125E-5,3.8996170147310131E-7]
[null,"CIA-1","Thallium and compounds","NoRBC",1.9500408806219597E-4,1.9500408806219598E-6]
[null,"CIA-1","Toluene","108-88-3",8.5605879999999995E-2,8.5605879999999998E-4]
[null,"CIA-1","Xylene (mixture), including m-xylene, o-xylene, p-xylene","1330-20-7",3.4437280000000001E-2,3.4437280000000002E-4]
[null,"CIA-1","Zinc and compounds","NoRBC",4.2447008799013156E-3,4.2447008799013156E-5]

{"sheet":"Identify Exposure Locations","index":3,"n_rows":11,"n_cols":10,"rows_kept":11,"cut":false,"hidden":false,"merged":[]}
[]
[null,"Exposure Locations"]
[null,"A map with the TEI and each Exposure Location labeled should be included with the submission."]
[]
[]
[null,"TEU Identifier","Residential Exposure Name","Distance (m)","Child Exposure Name","Distance (m)","Work Exposure Name","Distance (m)","Acute Exposure Name","Distance (m)"]
[null,"EU-2","R1",394.21893219573383,"DayC1",482.81277150496379,"W1",46.978973789568201,"W1",46.978973789568201]
[null,"EU-3","R1",389.93453412278967,"DayC1",479.52116848195692,"W2",41.583900470366565,"W2",41.583900470366565]
[null,"EU-4A","R1",391.10073625800101,"DayC1",480.10113860342187,"W2",44.650314425811231,"W2",44.650314425811231]
[null,"EU-4B","R1",391.65957093059114,"DayC1",479.09742896440395,"W2",44.901922383589628,"W2",44.901922383589628]
[null,"CIA-1","R1",395.27987135141029,"DayC2",478.64183638025554,"W2",12.855201141654483,"W2",12.855201141654483]

{"sheet":"Calculate Dispersion Factors","index":4,"n_rows":11,"n_cols":7,"rows_kept":11,"cut":false,"hidden":false,"merged":[[4,2,5,2],[4,1,5,1]]}
[]
[null,"Dispersion Factors"]
[]
[]
[null,"TEU","Type","DF Residential ","DF Child","DF Worker","DF Acute"]
[null,null,null,"ug/m3/lbs/yr","ug/m3/lbs/yr","ug/m3/lbs/yr","ug/m3/lbs/yr"]
[null,"EU-2","Point",9.9158140946734036E-5,6.7644786628143975E-5,1.3012728000000003E-3,3.4962240000000007]
[null,"EU-3","Fugitive",1.360392795263262E-4,9.1734072825052059E-5,3.3999999999999998E-3,2.9]
[null,"EU-4A","Point",1.0533955824519939E-4,7.6173703963110316E-5,3.3E-3,8.3000000000000007]
[null,"EU-4B","Point",1.0500425744164531E-4,7.6434668469254973E-5,3.3E-3,8.3000000000000007]
[null,"CIA-1","Point",1.0283207718915383E-4,7.6553122541133555E-5,3.3E-3,8.3000000000000007]

{"sheet":"Calculate Risk","index":5,"n_rows":75,"n_cols":18,"rows_kept":75,"cut":false,"hidden":false,"merged":[[4,17,5,17],[4,7,4,9],[4,10,5,10],[4,4,4,6],[4,1,5,1],[4,2,5,2],[4,3,5,3],[4,11,4,13],[4,14,4,16]]}
[]
[null,"Risk Calculations"]
[]
[]
[null,"TEU Identifier","TAC","CAS Number","Cancer RBC",null,null,"Chronic RBC",null,null,"Acute RBC","Cancer Risk",null,null,"Chronic Risk",null,null,"Acute"]
[null,null,null,null,"Residential","Child","Worker","Residential","Child","Worker",null,"Residential","Child","Worker","Residential","Child","Worker"]
[null,"EU-2","Arsenic and compounds","7440-38-2",2.4000000000000001E-5,1.2999999999999999E-3,6.2E-4,1.7000000000000001E-4,2.3999999999999998E-3,2.3999999999999998E-3,0.2,{"$f":"'Identify Toxic Air Contaminants'!$E7*VLOOKUP($B7,'Calculate Dispersion Factors'!$B$7:$N$11,3,FALSE)/E7","v":5.211751888160341E-3},{"$f":"'Identify Toxic Air Contaminants'!$E7*VLOOKUP($B7,'Calculate Dispersion Factors'!$B$7:$N$11,4,FALSE)/F7","v":6.5638338187850741E-5},{"$f":"'Identify Toxic Air Contaminants'!$E7*VLOOKUP($B7,'Calculate Dispersion Factors'!$B$7:$N$11,5,FALSE)/G7","v":2.6475444529548398E-3},{"$f":"'Identify Toxic Air Contaminants'!$E7*VLOOKUP($B7,'Calculate Dispersion Factors'!$B$7:$N$11,3,FALSE)/H7","v":7.3577673715204811E-4},{"$f":"'Identify Toxic Air Contaminants'!$E7*VLOOKUP($B7,'Calculate Dispersion Factors'!$B$7:$N$11,4,FALSE)/I7","v":3.5554099851752482E-5},{"$f":"'Identify Toxic Air Contaminants'!$E7*VLOOKUP($B7,'Calculate Dispersion Factors'!$B$7:$N$11,5,FALSE)/J7","v":6.8394898368000028E-4},{"$f":"'Identify Toxic Air Contaminants'!$F7*VLOOKUP($B7,'Calculate Dispersion Factors'!$B$7:$N$11,6,FALSE)/K7","v":6.0414750720000014E-5}]
[null,"EU-2","Barium and compounds","NoRBC","--","--","--","--","--","--","--"]
[null,"EU-2","Cadmium and compounds","7440-43-9",5.5999999999999995E-4,1.4E-2,6.7000000000000002E-3,5.0000000000000001E-3,3.6999999999999998E-2,3.6999999999999998E-2,0.03,{"$f":"'Identify Toxic Air Contaminants'!$E9*VLOOKUP($B9,'Calculate Dispersion Factors'!$B$7:$N$11,3,FALSE)/E9","v":4.4672159041374365E-5},{"$f":"'Identify Toxic Air Contaminants'!$E9*VLOOKUP($B9,'Calculate Dispersion Factors'!$B$7:$N$11,4,FALSE)/F9","v":1.2189977092029423E-6},{"$f":"'Identify Toxic Air Contaminants'!$E9*VLOOKUP($B9,'Calculate Dispersion Factors'!$B$7:$N$11,5,FALSE)/G9","v":4.8999330174089569E-5},{"$f":"'Identify Toxic Air Contaminants'!$E9*VLOOKUP($B9,'Calculate Dispersion Factors'!$B$7:$N$11,3,FALSE)/H9","v":5.0032818126339285E-6},{"$f":"'Identify Toxic Air Contaminants'!$E9*VLOOKUP($B9,'Calculate Dispersion Factors'!$B$7:$N$11,4,FALSE)/I9","v":4.6124237645516735E-7},{"$f":"'Identify Toxic Air Contaminants'!$E9*VLOOKUP($B9,'Calculate Dispersion Factors'!$B$7:$N$11,5,FALSE)/J9","v":8.8728516801729762E-6},{"$f":"'Identify Toxic Air Contaminants'!$F9*VLOOKUP($B9,'Calculate Dispersion Factors'!$B$7:$N$11,6,FALSE)/K9","v":8.0553000960000023E-5}]
[null,"EU-2","Chromium VI, chromate and dichromate particulate","18540-29-9",3.1000000000000001E-5,5.1999999999999995E-4,1E-3,8.3000000000000004E-2,0.88,0.88,0.3,{"$f":"'Identify Toxic Air Contaminants'!$E10*VLOOKUP($B10,'Calculate Dispersion Factors'!$B$7:$N$11,3,FALSE)/E10","v":1.4026097247399259E-2},{"$f":"'Identify Toxic Air Contaminants'!$E10*VLOOKUP($B10,'Calculate Dispersion Factors'!$B$7:$N$11,4,FALSE)/F10","v":5.7042841520394088E-4},{"$f":"'Identify Toxic Air Contaminants'!$E10*VLOOKUP($B10,'Calculate Dispersion Factors'!$B$7:$N$11,5,FALSE)/G10","v":5.7060886638445737E-3},{"$f":"'Identify Toxic Air Contaminants'!$E10*VLOOKUP($B10,'Calculate Dispersion Factors'!$B$7:$N$11,3,FALSE)/H10","v":5.2386628273418916E-6},{"$f":"'Identify Toxic Air Contaminants'!$E10*VLOOKUP($B10,'Calculate Dispersion Factors'!$B$7:$N$11,4,FALSE)/I10","v":3.3707133625687414E-7},{"$f":"'Identify Toxic Air Contaminants'!$E10*VLOOKUP($B10,'Calculate Dispersion Factors'!$B$7:$N$11,5,FALSE)/J10","v":6.4841916634597428E-6},{"$f":"'Identify Toxic Air Contaminants'!$F10*VLOOKUP($B10,'Calculate Dispersion Factors'!$B$7:$N$11,6,FALSE)/K10","v":1.4000878738285719E-4}]
[null,"EU-2","Lead and compounds","7439-92-1","--","--","--",0.15,0.66,0.66,0.15,"--","--","--",{"$f":"'Identify Toxic Air Contaminants'!$E11*VLOOKUP($B11,'Calculate Dispersion Factors'!$B$7:$N$11,3,FALSE)/H11","v":4.4791284798818018E-7},{"$f":"'Identify Toxic Air Contaminants'!$E11*VLOOKUP($B11,'Calculate Dispersion Factors'!$B$7:$N$11,4,FALSE)/I11","v":6.9445930100046393E-8},{"$f":"'Identify Toxic Air Contaminants'!$E11*VLOOKUP($B11,'Calculate Dispersion Factors'!$B$7:$N$11,5,FALSE)/J11","v":1.335921131759377E-6},{"$f":"'Identify Toxic Air Contaminants'!$F11*VLOOKUP($B11,'Calculate Dispersion Factors'!$B$7:$N$11,6,FALSE)/K11","v":4.3268469087085723E-5}]
[null,"EU-2","Mercury and compounds","7439-97-6","--","--","--",7.6999999999999999E-2,0.63,0.63,0.6,"--","--","--",{"$f":"'Identify Toxic Air Contaminants'!$E12*VLOOKUP($B12,'Calculate Dispersion Factors'!$B$7:$N$11,3,FALSE)/H12","v":1.3134775073983318E-7},{"$f":"'Identify Toxic Air Contaminants'!$E12*VLOOKUP($B12,'Calculate Dispersion Factors'!$B$7:$N$11,4,FALSE)/I12","v":1.0951630212839131E-8},{"$f":"'Identify Toxic Air Contaminants'!$E12*VLOOKUP($B12,'Calculate Dispersion Factors'!$B$7:$N$11,5,FALSE)/J12","v":2.1067489783013887E-7},{"$f":"'Identify Toxic Air Contaminants'!$F12*VLOOKUP($B12,'Calculate Dispersion Factors'!$B$7:$N$11,6,FALSE)/K12","v":1.628321376548572E-6}]
[null,"EU-2","Selenium and compounds","7782-49-2","--","--","--","--","--","--",2,"--","--","--","--","--","--",{"$f":"'Identify Toxic Air Contaminants'!$F13*VLOOKUP($B13,'Calculate Dispersion Factors'!$B$7:$N$11,6,FALSE)/K13","v":6.0414750720000016E-6}]
[null,"EU-2","Silver and compounds","NoRBC","--","--","--","--","--","--","--"]
[null,"EU-2","Molybdenum trioxide","NoRBC","--","--","--","--","--","--","--"]
[null,"EU-2","Nickel compounds, insoluble","365",3.8E-3,0.1,4.5999999999999999E-2,1.4E-2,6.2E-2,6.2E-2,0.2,{"$f":"'Identify Toxic Air Contaminants'!$E16*VLOOKUP($B16,'Calculate Dispersion Factors'!$B$7:$N$11,3,FALSE)/E16","v":1.4671277495693471E-4},{"$f":"'Identify Toxic Air Contaminants'!$E16*VLOOKUP($B16,'Calculate Dispersion Factors'!$B$7:$N$11,4,FALSE)/F16","v":3.8032728527131787E-6},{"$f":"'Identify Toxic Air Contaminants'!$E16*VLOOKUP($B16,'Calculate Dispersion Factors'!$B$7:$N$11,5,FALSE)/G16","v":1.5904999968310068E-4},{"$f":"'Identify Toxic Air Contaminants'!$E16*VLOOKUP($B16,'Calculate Dispersion Factors'!$B$7:$N$11,3,FALSE)/H16","v":3.9822038916882276E-5},{"$f":"'Identify Toxic Air Contaminants'!$E16*VLOOKUP($B16,'Calculate Dispersion Factors'!$B$7:$N$11,4,FALSE)/I16","v":6.1343110527631917E-6},{"$f":"'Identify Toxic Air Contaminants'!$E16*VLOOKUP($B16,'Calculate Dispersion Factors'!$B$7:$N$11,5,FALSE)/J16","v":1.1800483847455856E-4},{"$f":"'Identify Toxic Air Contaminants'!$F16*VLOOKUP($B16,'Calculate Dispersion Factors'!$B$7:$N$11,6,FALSE)/K16","v":2.6927717463771434E-4}]
[null,"EU-2","Manganese and compounds","7439-96-5","--","--","--",0.09,0.4,0.4,0.3,"--","--","--",{"$f":"'Identify Toxic Air Contaminants'!$E17*VLOOKUP($B17,'Calculate Dispersion Factors'!$B$7:$N$11,3,FALSE)/H17","v":1.6545244089397911E-4},{"$f":"'Identify Toxic Air Contaminants'!$E17*VLOOKUP($B17,'Calculate Dispersion Factors'!$B$7:$N$11,4,FALSE)/I17","v":2.5395785608394629E-5},{"$f":"'Identify Toxic Air Contaminants'!$E17*VLOOKUP($B17,'Calculate Dispersion Factors'!$B$7:$N$11,5,FALSE)/J17","v":4.8853498834285731E-4},{"$f":"'Identify Toxic Air Contaminants'!$F17*VLOOKUP($B17,'Calculate Dispersion Factors'!$B$7:$N$11,6,FALSE)/K17","v":4.7948214857142877E-3}]
[null,"EU-2","Aluminum and compounds","7429-90-5","--","--","--",5,22,22,"--","--","--","--",{"$f":"'Identify Toxic Air Contaminants'!$E18*VLOOKUP($B18,'Calculate Dispersion Factors'!$B$7:$N$11,3,FALSE)/H18","v":6.2898399930255084E-5},{"$f":"'Identify Toxic Air Contaminants'!$E18*VLOOKUP($B18,'Calculate Dispersion Factors'!$B$7:$N$11,4,FALSE)/I18","v":9.7519816736235364E-6},{"$f":"'Identify Toxic Air Contaminants'!$E18*VLOOKUP($B18,'Calculate Dispersion Factors'!$B$7:$N$11,5,FALSE)/J18","v":1.8759743552365719E-4},"--"]
[null,"EU-2","Cobalt and compounds","7440-48-4","--","--","--",0.1,0.44,0.44,"--","--","--","--",{"$f":"'Identify Toxic Air Contaminants'!$E19*VLOOKUP($B19,'Calculate Dispersion Factors'!$B$7:$N$11,3,FALSE)/H19","v":1.4962195134924313E-4},{"$f":"'Identify Toxic Air Contaminants'!$E19*VLOOKUP($B19,'Calculate Dispersion Factors'!$B$7:$N$11,4,FALSE)/I19","v":2.3197895799377193E-5},{"$f":"'Identify Toxic Air Contaminants'!$E19*VLOOKUP($B19,'Calculate Dispersion Factors'!$B$7:$N$11,5,FALSE)/J19","v":4.4625450571536627E-4},"--"]
[null,"EU-2","Phosphorus and compounds","NoRBC","--","--","--","--","--","--","--"]
[null,"EU-2","Vanadium (fume or dust)","7440-62-2","--","--","--",0.1,0.44,0.44,0.8,"--","--","--",{"$f":"'Identify Toxic Air Contaminants'!$E21*VLOOKUP($B21,'Calculate Dispersion Factors'!$B$7:$N$11,3,FALSE)/H21","v":3.1449199965127538E-3},{"$f":"'Identify Toxic Air Contaminants'!$E21*VLOOKUP($B21,'Calculate Dispersion Factors'!$B$7:$N$11,4,FALSE)/I21","v":4.8759908368117681E-4},{"$f":"'Identify Toxic Air Contaminants'!$E21*VLOOKUP($B21,'Calculate Dispersion Factors'!$B$7:$N$11,5,FALSE)/J21","v":9.379871776182859E-3},{"$f":"'Identify Toxic Air Contaminants'!$F21*VLOOKUP($B21,'Calculate Dispersion Factors'!$B$7:$N$11,6,FALSE)/K21","v":3.7974986166857148E-2}]
[null,"EU-3","Acetone","67-64-1","--","--","--",31000,140000,140000,62000,"--","--","--",{"$f":"'Identify Toxic Air Contaminants'!$E22*VLOOKUP($B22,'Calculate Dispersion Factors'!$B$7:$N$11,3,FALSE)/H22","v":2.1712329790606507E-5},{"$f":"'Identify Toxic Air Contaminants'!$E22*VLOOKUP($B22,'Calculate Dispersion Factors'!$B$7:$N$11,4,FALSE)/I22","v":3.2419509341919586E-6},{"$f":"'Identify Toxic Air Contaminants'!$E22*VLOOKUP($B22,'Calculate Dispersion Factors'!$B$7:$N$11,5,FALSE)/J22","v":1.2015854999999999E-4},{"$f":"'Identify Toxic Air Contaminants'!$F22*VLOOKUP($B22,'Calculate Dispersion Factors'!$B$7:$N$11,6,FALSE)/K22","v":1.2680817057003978E-3}]
[null,"EU-3","Isopropyl alcohol","67-63-0","--","--","--",200,880,880,3200,"--","--","--",{"$f":"'Identify Toxic Air Contaminants'!$E23*VLOOKUP($B23,'Calculate Dispersion Factors'!$B$7:$N$11,3,FALSE)/H23","v":3.3398833467408939E-3},{"$f":"'Identify Toxic Air Contaminants'!$E23*VLOOKUP($B23,'Calculate Dispersion Factors'!$B$7:$N$11,4,FALSE)/I23","v":5.1185267162926135E-4},{"$f":"'Identify Toxic Air Contaminants'!$E23*VLOOKUP($B23,'Calculate Dispersion Factors'!$B$7:$N$11,5,FALSE)/J23","v":1.8971130681818181E-2},{"$f":"'Identify Toxic Air Contaminants'!$F23*VLOOKUP($B23,'Calculate Dispersion Factors'!$B$7:$N$11,6,FALSE)/K23","v":2.4382718321917806E-2}]
[null,"EU-4A","Nitric Acid","7697-37-2","--","--","--","--","--","--",86,"--","--","--","--","--","--",{"$f":"'Identify Toxic Air Contaminants'!$F24*VLOOKUP($B24,'Calculate Dispersion Factors'!$B$7:$N$11,6,FALSE)/K24","v":5.4120489736534591E-3}]
[null,"EU-4B","Nitric Acid","7697-37-2","--","--","--","--","--","--",86,"--","--","--","--","--","--",{"$f":"'Identify Toxic Air Contaminants'!$F25*VLOOKUP($B25,'Calculate Dispersion Factors'!$B$7:$N$11,6,FALSE)/K25","v":1.4214173718873393E-2}]
[null,"CIA-1","1,3-Butadiene","106-99-0",3.3000000000000002E-2,0.86,0.4,2,8.8000000000000007,8.8000000000000007,660,{"$f":"'Identify Toxic Air Contaminants'!$E26*VLOOKUP($B26,'Calculate Dispersion Factors'!$B$7:$N$11,3,FALSE)/E26","v":5.5022104019469343E-4},{"$f":"'Identify Toxic Air Contaminants'!$E26*VLOOKUP($B26,'Calculate Dispersion Factors'!$B$7:$N$11,4,FALSE)/F26","v":1.571762719558994E-5},{"$f":"'Identify Toxic Air Contaminants'!$E26*VLOOKUP($B26,'Calculate Dispersion Factors'!$B$7:$N$11,5,FALSE)/G26","v":1.4567213100000003E-3},{"$f":"'Identify Toxic Air Contaminants'!$E26*VLOOKUP($B26,'Calculate Dispersion Factors'!$B$7:$N$11,3,FALSE)/H26","v":9.0786471632124425E-6},{"$f":"'Identify Toxic Air Contaminants'!$E26*VLOOKUP($B26,'Calculate Dispersion Factors'!$B$7:$N$11,4,FALSE)/I26","v":1.5360408395690166E-6},{"$f":"'Identify Toxic Air Contaminants'!$E26*VLOOKUP($B26,'Calculate Dispersion Factors'!$B$7:$N$11,5,FALSE)/J26","v":6.6214605000000008E-5},{"$f":"'Identify Toxic Air Contaminants'!$F26*VLOOKUP($B26,'Calculate Dispersion Factors'!$B$7:$N$11,6,FALSE)/K26","v":2.2205301878787882E-5}]
[null,"CIA-1","2-Methyl naphthalene","NoRBC","--","--","--","--","--","--","--"]
[null,"CIA-1","Acenaphthene","NoRBC","--","--","--","--","--","--","--"]
[null,"CIA-1","Acenaphthylene","NoRBC","--","--","--","--","--","--","--"]
[null,"CIA-1","Acetaldehyde","75-07-0",0.45,12,5.5,140,620,620,470,{"$f":"'Identify Toxic Air Contaminants'!$E30*VLOOKUP($B30,'Calculate Dispersion Factors'!$B$7:$N$11,3,FALSE)/E30","v":1.4538085092393553E-4},{"$f":"'Identify Toxic Air Contaminants'!$E30*VLOOKUP($B30,'Calculate Dispersion Factors'!$B$7:$N$11,4,FALSE)/F30","v":4.0585675209992392E-6},{"$f":"'Identify Toxic Air Contaminants'!$E30*VLOOKUP($B30,'Calculate Dispersion Factors'!$B$7:$N$11,5,FALSE)/G30","v":3.8171775600000007E-4},{"$f":"'Identify Toxic Air Contaminants'!$E30*VLOOKUP($B30,'Calculate Dispersion Factors'!$B$7:$N$11,3,FALSE)/H30","v":4.6729559225550707E-7},{"$f":"'Identify Toxic Air Contaminants'!$E30*VLOOKUP($B30,'Calculate Dispersion Factors'!$B$7:$N$11,4,FALSE)/I30","v":7.8552919761275599E-8},{"$f":"'Identify Toxic Air Contaminants'!$E30*VLOOKUP($B30,'Calculate Dispersion Factors'!$B$7:$N$11,5,FALSE)/J30","v":3.3862059000000005E-6},{"$f":"'Identify Toxic Air Contaminants'!$F30*VLOOKUP($B30,'Calculate Dispersion Factors'!$B$7:$N$11,6,FALSE)/K30","v":1.1234955229787236E-4}]
[null,"CIA-1","Acrolein","107-02-8","--","--","--",0.35,1.5,1.5,6.9,"--","--","--",{"$f":"'Identify Toxic Air Contaminants'!$E31*VLOOKUP($B31,'Calculate Dispersion Factors'!$B$7:$N$11,3,FALSE)/H31","v":8.0895292110106917E-6},{"$f":"'Identify Toxic Air Contaminants'!$E31*VLOOKUP($B31,'Calculate Dispersion Factors'!$B$7:$N$11,4,FALSE)/I31","v":1.4051876824907361E-6},{"$f":"'Identify Toxic Air Contaminants'!$E31*VLOOKUP($B31,'Calculate Dispersion Factors'!$B$7:$N$11,5,FALSE)/J31","v":6.0573876000000007E-5},{"$f":"'Identify Toxic Air Contaminants'!$F31*VLOOKUP($B31,'Calculate Dispersion Factors'!$B$7:$N$11,6,FALSE)/K31","v":3.3120103478260875E-4}]
[null,"CIA-1","Ammonia","7664-41-7","--","--","--",500,2200,2200,1200,"--","--","--",{"$f":"'Identify Toxic Air Contaminants'!$E32*VLOOKUP($B32,'Calculate Dispersion Factors'!$B$7:$N$11,3,FALSE)/H32","v":1.3363234094884922E-7},{"$f":"'Identify Toxic Air Contaminants'!$E32*VLOOKUP($B32,'Calculate Dispersion Factors'!$B$7:$N$11,4,FALSE)/I32","v":2.2609616773784978E-8},{"$f":"'Identify Toxic Air Contaminants'!$E32*VLOOKUP($B32,'Calculate Dispersion Factors'!$B$7:$N$11,5,FALSE)/J32","v":9.7464000000000021E-7},{"$f":"'Identify Toxic Air Contaminants'!$F32*VLOOKUP($B32,'Calculate Dispersion Factors'!$B$7:$N$11,6,FALSE)/K32","v":4.4941733333333344E-5}]
[null,"CIA-1","Anthracene","NoRBC","--","--","--","--","--","--","--"]
[null,"CIA-1","Antimony and compounds","7440-36-0","--","--","--",0.3,1.3,1.3,1,"--","--","--",{"$f":"'Identify Toxic Air Contaminants'!$E34*VLOOKUP($B34,'Calculate Dispersion Factors'!$B$7:$N$11,3,FALSE)/H34","v":8.8583562828352106E-8},{"$f":"'Identify Toxic Air Contaminants'!$E34*VLOOKUP($B34,'Calculate Dispersion Factors'!$B$7:$N$11,4,FALSE)/I34","v":1.5218272185607397E-8},{"$f":"'Identify Toxic Air Contaminants'!$E34*VLOOKUP($B34,'Calculate Dispersion Factors'!$B$7:$N$11,5,FALSE)/J34","v":6.5601893881624513E-7},{"$f":"'Identify Toxic Air Contaminants'!$F34*VLOOKUP($B34,'Calculate Dispersion Factors'!$B$7:$N$11,6,FALSE)/K34","v":2.144983136311299E-5}]
[null,"CIA-1","Arsenic and compounds","7440-38-2",2.4000000000000001E-5,1.2999999999999999E-3,6.2E-4,1.7000000000000001E-4,2.3999999999999998E-3,2.3999999999999998E-3,0.2,{"$f":"'Identify Toxic Air Contaminants'!$E35*VLOOKUP($B35,'Calculate Dispersion Factors'!$B$7:$N$11,3,FALSE)/E35","v":9.6344977891244942E-4},{"$f":"'Identify Toxic Air Contaminants'!$E35*VLOOKUP($B35,'Calculate Dispersion Factors'!$B$7:$N$11,4,FALSE)/F35","v":1.3241319725252854E-5},{"$f":"'Identify Toxic Air Contaminants'!$E35*VLOOKUP($B35,'Calculate Dispersion Factors'!$B$7:$N$11,5,FALSE)/G35","v":1.1968341286483798E-3},{"$f":"'Identify Toxic Air Contaminants'!$E35*VLOOKUP($B35,'Calculate Dispersion Factors'!$B$7:$N$11,3,FALSE)/H35","v":1.3601643937587521E-4},{"$f":"'Identify Toxic Air Contaminants'!$E35*VLOOKUP($B35,'Calculate Dispersion Factors'!$B$7:$N$11,4,FALSE)/I35","v":7.1723815178452956E-6},{"$f":"'Identify Toxic Air Contaminants'!$E35*VLOOKUP($B35,'Calculate Dispersion Factors'!$B$7:$N$11,5,FALSE)/J35","v":3.0918214990083146E-4},{"$f":"'Identify Toxic Air Contaminants'!$F35*VLOOKUP($B35,'Calculate Dispersion Factors'!$B$7:$N$11,6,FALSE)/K35","v":9.3316794333705514E-5}]
[null,"CIA-1","Barium and compounds","NoRBC","--","--","--","--","--","--","--"]
[null,"CIA-1","Benz[a]anthracene","56-55-3",2.1000000000000001E-4,7.7999999999999996E-3,1.4999999999999999E-2,"--","--","--","--",{"$f":"'Identify Toxic Air Contaminants'!$E37*VLOOKUP($B37,'Calculate Dispersion Factors'!$B$7:$N$11,3,FALSE)/E37","v":1.9305627139888708E-5},{"$f":"'Identify Toxic Air Contaminants'!$E37*VLOOKUP($B37,'Calculate Dispersion Factors'!$B$7:$N$11,4,FALSE)/F37","v":3.8693935873215537E-7},{"$f":"'Identify Toxic Air Contaminants'!$E37*VLOOKUP($B37,'Calculate Dispersion Factors'!$B$7:$N$11,5,FALSE)/G37","v":8.6735578842992902E-6},"--","--","--","--"]
[null,"CIA-1","Benzene","71-43-2",0.13,3.3,1.5,3,13,13,29,{"$f":"'Identify Toxic Air Contaminants'!$E38*VLOOKUP($B38,'Calculate Dispersion Factors'!$B$7:$N$11,3,FALSE)/E38","v":1.1969088999408941E-4},{"$f":"'Identify Toxic Air Contaminants'!$E38*VLOOKUP($B38,'Calculate Dispersion Factors'!$B$7:$N$11,4,FALSE)/F38","v":3.5101430041301172E-6},{"$f":"'Identify Toxic Air Contaminants'!$E38*VLOOKUP($B38,'Calculate Dispersion Factors'!$B$7:$N$11,5,FALSE)/G38","v":3.3288829200000001E-4},{"$f":"'Identify Toxic Air Contaminants'!$E38*VLOOKUP($B38,'Calculate Dispersion Factors'!$B$7:$N$11,3,FALSE)/H38","v":5.1866052330772082E-6},{"$f":"'Identify Toxic Air Contaminants'!$E38*VLOOKUP($B38,'Calculate Dispersion Factors'!$B$7:$N$11,4,FALSE)/I38","v":8.9103630104841428E-7},{"$f":"'Identify Toxic Air Contaminants'!$E38*VLOOKUP($B38,'Calculate Dispersion Factors'!$B$7:$N$11,5,FALSE)/J38","v":3.841018753846154E-5},{"$f":"'Identify Toxic Air Contaminants'!$F38*VLOOKUP($B38,'Calculate Dispersion Factors'!$B$7:$N$11,6,FALSE)/K38","v":4.3306784068965518E-4}]
[null,"CIA-1","Benzo[a]pyrene","50-32-8",4.3000000000000002E-5,1.6000000000000001E-3,3.0000000000000001E-3,2E-3,8.8000000000000005E-3,8.8000000000000005E-3,2E-3,{"$f":"'Identify Toxic Air Contaminants'!$E39*VLOOKUP($B39,'Calculate Dispersion Factors'!$B$7:$N$11,3,FALSE)/E39","v":2.7940885796750931E-5},{"$f":"'Identify Toxic Air Contaminants'!$E39*VLOOKUP($B39,'Calculate Dispersion Factors'!$B$7:$N$11,4,FALSE)/F39","v":5.59014334639446E-7},{"$f":"'Identify Toxic Air Contaminants'!$E39*VLOOKUP($B39,'Calculate Dispersion Factors'!$B$7:$N$11,5,FALSE)/G39","v":1.2852058757456616E-5},{"$f":"'Identify Toxic Air Contaminants'!$E39*VLOOKUP($B39,'Calculate Dispersion Factors'!$B$7:$N$11,3,FALSE)/H39","v":6.0072904463014501E-7},{"$f":"'Identify Toxic Air Contaminants'!$E39*VLOOKUP($B39,'Calculate Dispersion Factors'!$B$7:$N$11,4,FALSE)/I39","v":1.0163896993444473E-7},{"$f":"'Identify Toxic Air Contaminants'!$E39*VLOOKUP($B39,'Calculate Dispersion Factors'!$B$7:$N$11,5,FALSE)/J39","v":4.3813836673147551E-6},{"$f":"'Identify Toxic Air Contaminants'!$F39*VLOOKUP($B39,'Calculate Dispersion Factors'!$B$7:$N$11,6,FALSE)/K39","v":4.8487312584949964E-4}]
[null,"CIA-1","Benzo[b]fluoranthene","205-99-2",5.3000000000000001E-5,2E-3,3.8E-3,"--","--","--","--",{"$f":"'Identify Toxic Air Contaminants'!$E40*VLOOKUP($B40,'Calculate Dispersion Factors'!$B$7:$N$11,3,FALSE)/E40","v":6.989472259155398E-5},{"$f":"'Identify Toxic Air Contaminants'!$E40*VLOOKUP($B40,'Calculate Dispersion Factors'!$B$7:$N$11,4,FALSE)/F40","v":1.3788739307747289E-6},{"$f":"'Identify Toxic Air Contaminants'!$E40*VLOOKUP($B40,'Calculate Dispersion Factors'!$B$7:$N$11,5,FALSE)/G40","v":3.1283979298590257E-5},"--","--","--","--"]
[null,"CIA-1","Benzo[e]pyrene","NoRBC","--","--","--","--","--","--","--"]
[null,"CIA-1","Benzo[g,h,i]perylene","191-24-2",4.7000000000000002E-3,0.17,0.34,"--","--","--","--",{"$f":"'Identify Toxic Air Contaminants'!$E42*VLOOKUP($B42,'Calculate Dispersion Factors'!$B$7:$N$11,3,FALSE)/E42","v":3.8871193387465471E-7},{"$f":"'Identify Toxic Air Contaminants'!$E42*VLOOKUP($B42,'Calculate Dispersion Factors'!$B$7:$N$11,4,FALSE)/F42","v":8.0003891476359671E-9},{"$f":"'Identify Toxic Air Contaminants'!$E42*VLOOKUP($B42,'Calculate Dispersion Factors'!$B$7:$N$11,5,FALSE)/G42","v":1.7243767014867844E-7},"--","--","--","--"]
[null,"CIA-1","Benzo[k]fluoranthene","207-08-9",1.4E-3,5.1999999999999998E-2,0.1,"--","--","--","--",{"$f":"'Identify Toxic Air Contaminants'!$E43*VLOOKUP($B43,'Calculate Dispersion Factors'!$B$7:$N$11,3,FALSE)/E43","v":7.78787744845428E-7},{"$f":"'Identify Toxic Air Contaminants'!$E43*VLOOKUP($B43,'Calculate Dispersion Factors'!$B$7:$N$11,4,FALSE)/F43","v":1.5609108597996495E-8},{"$f":"'Identify Toxic Air Contaminants'!$E43*VLOOKUP($B43,'Calculate Dispersion Factors'!$B$7:$N$11,5,FALSE)/G43","v":3.4989076167036472E-7},"--","--","--","--"]
[null,"CIA-1","Beryllium and compounds","7440-41-7",4.2000000000000002E-4,1.0999999999999999E-2,5.0000000000000001E-3,7.0000000000000001E-3,3.1E-2,3.1E-2,0.02,{"$f":"'Identify Toxic Air Contaminants'!$E44*VLOOKUP($B44,'Calculate Dispersion Factors'!$B$7:$N$11,3,FALSE)/E44","v":9.4871928014192288E-7},{"$f":"'Identify Toxic Air Contaminants'!$E44*VLOOKUP($B44,'Calculate Dispersion Factors'!$B$7:$N$11,4,FALSE)/F44","v":2.6966751500404052E-8},{"$f":"'Identify Toxic Air Contaminants'!$E44*VLOOKUP($B44,'Calculate Dispersion Factors'!$B$7:$N$11,5,FALSE)/G44","v":2.5574216882889074E-6},{"$f":"'Identify Toxic Air Contaminants'!$E44*VLOOKUP($B44,'Calculate Dispersion Factors'!$B$7:$N$11,3,FALSE)/H44","v":5.6923156808515371E-8},{"$f":"'Identify Toxic Air Contaminants'!$E44*VLOOKUP($B44,'Calculate Dispersion Factors'!$B$7:$N$11,4,FALSE)/I44","v":9.5688473065949858E-9},{"$f":"'Identify Toxic Air Contaminants'!$E44*VLOOKUP($B44,'Calculate Dispersion Factors'!$B$7:$N$11,5,FALSE)/J44","v":4.1248736907885606E-7},{"$f":"'Identify Toxic Air Contaminants'!$F44*VLOOKUP($B44,'Calculate Dispersion Factors'!$B$7:$N$11,6,FALSE)/K44","v":1.6080757585452981E-5}]
[null,"CIA-1","Cadmium and compounds","7440-43-9",5.5999999999999995E-4,1.4E-2,6.7000000000000002E-3,5.0000000000000001E-3,3.6999999999999998E-2,3.6999999999999998E-2,0.03,{"$f":"'Identify Toxic Air Contaminants'!$E45*VLOOKUP($B45,'Calculate Dispersion Factors'!$B$7:$N$11,3,FALSE)/E45","v":1.2047536566012257E-5},{"$f":"'Identify Toxic Air Contaminants'!$E45*VLOOKUP($B45,'Calculate Dispersion Factors'!$B$7:$N$11,4,FALSE)/F45","v":3.5875052542612656E-7},{"$f":"'Identify Toxic Air Contaminants'!$E45*VLOOKUP($B45,'Calculate Dispersion Factors'!$B$7:$N$11,5,FALSE)/G45","v":3.2314452992754523E-5},{"$f":"'Identify Toxic Air Contaminants'!$E45*VLOOKUP($B45,'Calculate Dispersion Factors'!$B$7:$N$11,3,FALSE)/H45","v":1.3493240953933725E-6},{"$f":"'Identify Toxic Air Contaminants'!$E45*VLOOKUP($B45,'Calculate Dispersion Factors'!$B$7:$N$11,4,FALSE)/I45","v":1.3574344205312899E-7},{"$f":"'Identify Toxic Air Contaminants'!$E45*VLOOKUP($B45,'Calculate Dispersion Factors'!$B$7:$N$11,5,FALSE)/J45","v":5.851536082471766E-6},{"$f":"'Identify Toxic Air Contaminants'!$F45*VLOOKUP($B45,'Calculate Dispersion Factors'!$B$7:$N$11,6,FALSE)/K45","v":1.8151583140677569E-4}]
[null,"CIA-1","Chlorobenzene","108-90-7","--","--","--",50,220,220,"--","--","--","--",{"$f":"'Identify Toxic Air Contaminants'!$E46*VLOOKUP($B46,'Calculate Dispersion Factors'!$B$7:$N$11,3,FALSE)/H46","v":3.3408085237212302E-10},{"$f":"'Identify Toxic Air Contaminants'!$E46*VLOOKUP($B46,'Calculate Dispersion Factors'!$B$7:$N$11,4,FALSE)/I46","v":5.6524041934462438E-11},{"$f":"'Identify Toxic Air Contaminants'!$E46*VLOOKUP($B46,'Calculate Dispersion Factors'!$B$7:$N$11,5,FALSE)/J46","v":2.4366000000000005E-9},"--"]
[null,"CIA-1","Chromium VI, chromate and dichromate particulate","18540-29-9",3.1000000000000001E-5,5.1999999999999995E-4,1E-3,8.3000000000000004E-2,0.88,0.88,0.3,{"$f":"'Identify Toxic Air Contaminants'!$E47*VLOOKUP($B47,'Calculate Dispersion Factors'!$B$7:$N$11,3,FALSE)/E47","v":1.7012382980064611E-4},{"$f":"'Identify Toxic Air Contaminants'!$E47*VLOOKUP($B47,'Calculate Dispersion Factors'!$B$7:$N$11,4,FALSE)/F47","v":7.5501886391728651E-6},{"$f":"'Identify Toxic Air Contaminants'!$E47*VLOOKUP($B47,'Calculate Dispersion Factors'!$B$7:$N$11,5,FALSE)/G47","v":1.6924356936399355E-4},{"$f":"'Identify Toxic Air Contaminants'!$E47*VLOOKUP($B47,'Calculate Dispersion Factors'!$B$7:$N$11,3,FALSE)/H47","v":6.3540225588193119E-8},{"$f":"'Identify Toxic Air Contaminants'!$E47*VLOOKUP($B47,'Calculate Dispersion Factors'!$B$7:$N$11,4,FALSE)/I47","v":4.4614751049657839E-9},{"$f":"'Identify Toxic Air Contaminants'!$E47*VLOOKUP($B47,'Calculate Dispersion Factors'!$B$7:$N$11,5,FALSE)/J47","v":1.9232223791362904E-7},{"$f":"'Identify Toxic Air Contaminants'!$F47*VLOOKUP($B47,'Calculate Dispersion Factors'!$B$7:$N$11,6,FALSE)/K47","v":1.4189107330516634E-5}]
[null,"CIA-1","Chrysene","218-01-9",4.2999999999999999E-4,1.6E-2,0.03,"--","--","--","--",{"$f":"'Identify Toxic Air Contaminants'!$E48*VLOOKUP($B48,'Calculate Dispersion Factors'!$B$7:$N$11,3,FALSE)/E48","v":1.3013597730585032E-5},{"$f":"'Identify Toxic Air Contaminants'!$E48*VLOOKUP($B48,'Calculate Dispersion Factors'!$B$7:$N$11,4,FALSE)/F48","v":2.603635306892931E-7},{"$f":"'Identify Toxic Air Contaminants'!$E48*VLOOKUP($B48,'Calculate Dispersion Factors'!$B$7:$N$11,5,FALSE)/G48","v":5.9859062413415506E-6},"--","--","--","--"]
[null,"CIA-1","Cobalt and compounds","7440-48-4","--","--","--",0.1,0.44,0.44,"--","--","--","--",{"$f":"'Identify Toxic Air Contaminants'!$E49*VLOOKUP($B49,'Calculate Dispersion Factors'!$B$7:$N$11,3,FALSE)/H49","v":1.3155383840300229E-8},{"$f":"'Identify Toxic Air Contaminants'!$E49*VLOOKUP($B49,'Calculate Dispersion Factors'!$B$7:$N$11,4,FALSE)/I49","v":2.2257949312964822E-9},{"$f":"'Identify Toxic Air Contaminants'!$E49*VLOOKUP($B49,'Calculate Dispersion Factors'!$B$7:$N$11,5,FALSE)/J49","v":9.5948055800489474E-8},"--"]
[null,"CIA-1","Copper and compounds","7440-50-8","--","--","--","--","--","--",100,"--","--","--","--","--","--",{"$f":"'Identify Toxic Air Contaminants'!$F50*VLOOKUP($B50,'Calculate Dispersion Factors'!$B$7:$N$11,6,FALSE)/K50","v":3.3850239940047515E-7}]
[null,"CIA-1","Dibenz[a,h]anthracene","53-70-3",4.3000000000000003E-6,1.6000000000000001E-4,2.9999999999999997E-4,"--","--","--","--",{"$f":"'Identify Toxic Air Contaminants'!$E51*VLOOKUP($B51,'Calculate Dispersion Factors'!$B$7:$N$11,3,FALSE)/E51","v":2.0141708716937783E-5},{"$f":"'Identify Toxic Air Contaminants'!$E51*VLOOKUP($B51,'Calculate Dispersion Factors'!$B$7:$N$11,4,FALSE)/F51","v":4.0297591059943422E-7},{"$f":"'Identify Toxic Air Contaminants'!$E51*VLOOKUP($B51,'Calculate Dispersion Factors'!$B$7:$N$11,5,FALSE)/G51","v":9.2646462889076326E-6},"--","--","--","--"]
[null,"CIA-1","Diesel particulate matter","200",0.1,2.6,1.2,5,22,22,"--",{"$f":"'Identify Toxic Air Contaminants'!$E52*VLOOKUP($B52,'Calculate Dispersion Factors'!$B$7:$N$11,3,FALSE)/E52","v":1.4177761382048387E-2},{"$f":"'Identify Toxic Air Contaminants'!$E52*VLOOKUP($B52,'Calculate Dispersion Factors'!$B$7:$N$11,4,FALSE)/F52","v":4.0594632684599495E-4},{"$f":"'Identify Toxic Air Contaminants'!$E52*VLOOKUP($B52,'Calculate Dispersion Factors'!$B$7:$N$11,5,FALSE)/G52","v":3.7915060034151876E-2},{"$f":"'Identify Toxic Air Contaminants'!$E52*VLOOKUP($B52,'Calculate Dispersion Factors'!$B$7:$N$11,3,FALSE)/H52","v":2.8355522764096777E-4},{"$f":"'Identify Toxic Air Contaminants'!$E52*VLOOKUP($B52,'Calculate Dispersion Factors'!$B$7:$N$11,4,FALSE)/I52","v":4.7975474990890316E-5},{"$f":"'Identify Toxic Air Contaminants'!$E52*VLOOKUP($B52,'Calculate Dispersion Factors'!$B$7:$N$11,5,FALSE)/J52","v":2.0680941836810113E-3},"--"]
[null,"CIA-1","Ethyl benzene","100-41-4",0.4,10,4.8,260,1100,1100,22000,{"$f":"'Identify Toxic Air Contaminants'!$E53*VLOOKUP($B53,'Calculate Dispersion Factors'!$B$7:$N$11,3,FALSE)/E53","v":2.2759258067850876E-6},{"$f":"'Identify Toxic Air Contaminants'!$E53*VLOOKUP($B53,'Calculate Dispersion Factors'!$B$7:$N$11,4,FALSE)/F53","v":6.7772326279420457E-8},{"$f":"'Identify Toxic Air Contaminants'!$E53*VLOOKUP($B53,'Calculate Dispersion Factors'!$B$7:$N$11,5,FALSE)/G53","v":6.0864237499999998E-6},{"$f":"'Identify Toxic Air Contaminants'!$E53*VLOOKUP($B53,'Calculate Dispersion Factors'!$B$7:$N$11,3,FALSE)/H53","v":3.5014243181309038E-9},{"$f":"'Identify Toxic Air Contaminants'!$E53*VLOOKUP($B53,'Calculate Dispersion Factors'!$B$7:$N$11,4,FALSE)/I53","v":6.1611205708564049E-10},{"$f":"'Identify Toxic Air Contaminants'!$E53*VLOOKUP($B53,'Calculate Dispersion Factors'!$B$7:$N$11,5,FALSE)/J53","v":2.6558940000000001E-8},{"$f":"'Identify Toxic Air Contaminants'!$F53*VLOOKUP($B53,'Calculate Dispersion Factors'!$B$7:$N$11,6,FALSE)/K53","v":3.3399879090909094E-8}]
[null,"CIA-1","Fluoranthene","206-44-0",5.2999999999999998E-4,0.02,3.7999999999999999E-2,"--","--","--","--",{"$f":"'Identify Toxic Air Contaminants'!$E54*VLOOKUP($B54,'Calculate Dispersion Factors'!$B$7:$N$11,3,FALSE)/E54","v":5.8299198148203478E-5},{"$f":"'Identify Toxic Air Contaminants'!$E54*VLOOKUP($B54,'Calculate Dispersion Factors'!$B$7:$N$11,4,FALSE)/F54","v":1.1501189436202445E-6},{"$f":"'Identify Toxic Air Contaminants'!$E54*VLOOKUP($B54,'Calculate Dispersion Factors'!$B$7:$N$11,5,FALSE)/G54","v":2.6093971624306855E-5},"--","--","--","--"]
[null,"CIA-1","Fluorene","NoRBC","--","--","--","--","--","--","--"]
[null,"CIA-1","Formaldehyde","50-00-0",0.17,4.3,2,9,40,40,49,{"$f":"'Identify Toxic Air Contaminants'!$E56*VLOOKUP($B56,'Calculate Dispersion Factors'!$B$7:$N$11,3,FALSE)/E56","v":1.3329151782970133E-3},{"$f":"'Identify Toxic Air Contaminants'!$E56*VLOOKUP($B56,'Calculate Dispersion Factors'!$B$7:$N$11,4,FALSE)/F56","v":3.9229907181770453E-5},{"$f":"'Identify Toxic Air Contaminants'!$E56*VLOOKUP($B56,'Calculate Dispersion Factors'!$B$7:$N$11,5,FALSE)/G56","v":3.6358568039482077E-3},{"$f":"'Identify Toxic Air Contaminants'!$E56*VLOOKUP($B56,'Calculate Dispersion Factors'!$B$7:$N$11,3,FALSE)/H56","v":2.5177286701165809E-5},{"$f":"'Identify Toxic Air Contaminants'!$E56*VLOOKUP($B56,'Calculate Dispersion Factors'!$B$7:$N$11,4,FALSE)/I56","v":4.2172150220403235E-6},{"$f":"'Identify Toxic Air Contaminants'!$E56*VLOOKUP($B56,'Calculate Dispersion Factors'!$B$7:$N$11,5,FALSE)/J56","v":1.8179284019741038E-4},{"$f":"'Identify Toxic Air Contaminants'!$F56*VLOOKUP($B56,'Calculate Dispersion Factors'!$B$7:$N$11,6,FALSE)/K56","v":3.7325431629895026E-3}]
[null,"CIA-1","Hexane","110-54-3","--","--","--",700,3100,3100,"--","--","--","--",{"$f":"'Identify Toxic Air Contaminants'!$E57*VLOOKUP($B57,'Calculate Dispersion Factors'!$B$7:$N$11,3,FALSE)/H57","v":3.2095624745750386E-9},{"$f":"'Identify Toxic Air Contaminants'!$E57*VLOOKUP($B57,'Calculate Dispersion Factors'!$B$7:$N$11,4,FALSE)/I57","v":5.3953109704540105E-10},{"$f":"'Identify Toxic Air Contaminants'!$E57*VLOOKUP($B57,'Calculate Dispersion Factors'!$B$7:$N$11,5,FALSE)/J57","v":2.3257739999999999E-8},"--"]
[null,"CIA-1","Hydrochloric acid","7647-01-0","--","--","--",20,88,88,2100,"--","--","--",{"$f":"'Identify Toxic Air Contaminants'!$E58*VLOOKUP($B58,'Calculate Dispersion Factors'!$B$7:$N$11,3,FALSE)/H58","v":7.7799078496158127E-7},{"$f":"'Identify Toxic Air Contaminants'!$E58*VLOOKUP($B58,'Calculate Dispersion Factors'!$B$7:$N$11,4,FALSE)/I58","v":1.3163036265487938E-7},{"$f":"'Identify Toxic Air Contaminants'!$E58*VLOOKUP($B58,'Calculate Dispersion Factors'!$B$7:$N$11,5,FALSE)/J58","v":5.6742322499999997E-6},{"$f":"'Identify Toxic Air Contaminants'!$F58*VLOOKUP($B58,'Calculate Dispersion Factors'!$B$7:$N$11,6,FALSE)/K58","v":5.9804606571428577E-6}]
[null,"CIA-1","Indeno[1,2,3-cd]pyrene","193-39-5",6.0999999999999997E-4,2.1999999999999999E-2,4.2999999999999997E-2,"--","--","--","--",{"$f":"'Identify Toxic Air Contaminants'!$E59*VLOOKUP($B59,'Calculate Dispersion Factors'!$B$7:$N$11,3,FALSE)/E59","v":1.4665291694520544E-6},{"$f":"'Identify Toxic Air Contaminants'!$E59*VLOOKUP($B59,'Calculate Dispersion Factors'!$B$7:$N$11,4,FALSE)/F59","v":3.0271375906171964E-8},{"$f":"'Identify Toxic Air Contaminants'!$E59*VLOOKUP($B59,'Calculate Dispersion Factors'!$B$7:$N$11,5,FALSE)/G59","v":6.6763241786688998E-7},"--","--","--","--"]
[null,"CIA-1","Lead and compounds","7439-92-1","--","--","--",0.15,0.66,0.66,0.15,"--","--","--",{"$f":"'Identify Toxic Air Contaminants'!$E60*VLOOKUP($B60,'Calculate Dispersion Factors'!$B$7:$N$11,3,FALSE)/H60","v":2.0249282554234941E-7},{"$f":"'Identify Toxic Air Contaminants'!$E60*VLOOKUP($B60,'Calculate Dispersion Factors'!$B$7:$N$11,4,FALSE)/I60","v":3.4260308189211916E-8},{"$f":"'Identify Toxic Air Contaminants'!$E60*VLOOKUP($B60,'Calculate Dispersion Factors'!$B$7:$N$11,5,FALSE)/J60","v":1.4768700906177984E-6},{"$f":"'Identify Toxic Air Contaminants'!$F60*VLOOKUP($B60,'Calculate Dispersion Factors'!$B$7:$N$11,6,FALSE)/K60","v":1.6344029002836972E-4}]
[null,"CIA-1","Manganese and compounds","7439-96-5","--","--","--",0.09,0.4,0.4,0.3,"--","--","--",{"$f":"'Identify Toxic Air Contaminants'!$E61*VLOOKUP($B61,'Calculate Dispersion Factors'!$B$7:$N$11,3,FALSE)/H61","v":3.896799326752374E-7},{"$f":"'Identify Toxic Air Contaminants'!$E61*VLOOKUP($B61,'Calculate Dispersion Factors'!$B$7:$N$11,4,FALSE)/I61","v":6.5271690526905703E-8},{"$f":"'Identify Toxic Air Contaminants'!$E61*VLOOKUP($B61,'Calculate Dispersion Factors'!$B$7:$N$11,5,FALSE)/J61","v":2.8136876927920458E-6},{"$f":"'Identify Toxic Air Contaminants'!$F61*VLOOKUP($B61,'Calculate Dispersion Factors'!$B$7:$N$11,6,FALSE)/K61","v":9.435801151585448E-5}]
[null,"CIA-1","Mercury and compounds","7439-97-6","--","--","--",7.6999999999999999E-2,0.63,0.63,0.6,"--","--","--",{"$f":"'Identify Toxic Air Contaminants'!$E62*VLOOKUP($B62,'Calculate Dispersion Factors'!$B$7:$N$11,3,FALSE)/H62","v":1.6386596968999627E-8},{"$f":"'Identify Toxic Air Contaminants'!$E62*VLOOKUP($B62,'Calculate Dispersion Factors'!$B$7:$N$11,4,FALSE)/I62","v":1.4909849145415395E-9},{"$f":"'Identify Toxic Air Contaminants'!$E62*VLOOKUP($B62,'Calculate Dispersion Factors'!$B$7:$N$11,5,FALSE)/J62","v":6.4272364792740231E-8},{"$f":"'Identify Toxic Air Contaminants'!$F62*VLOOKUP($B62,'Calculate Dispersion Factors'!$B$7:$N$11,6,FALSE)/K62","v":1.6973747247537306E-6}]
[null,"CIA-1","Naphthalene","91-20-3",2.9000000000000001E-2,0.76,0.35,3.7,16,16,200,{"$f":"'Identify Toxic Air Contaminants'!$E63*VLOOKUP($B63,'Calculate Dispersion Factors'!$B$7:$N$11,3,FALSE)/E63","v":7.5895080046622953E-5},{"$f":"'Identify Toxic Air Contaminants'!$E63*VLOOKUP($B63,'Calculate Dispersion Factors'!$B$7:$N$11,4,FALSE)/F63","v":2.1559184558435827E-6},{"$f":"'Identify Toxic Air Contaminants'!$E63*VLOOKUP($B63,'Calculate Dispersion Factors'!$B$7:$N$11,5,FALSE)/G63","v":2.0180359944916087E-4},{"$f":"'Identify Toxic Air Contaminants'!$E63*VLOOKUP($B63,'Calculate Dispersion Factors'!$B$7:$N$11,3,FALSE)/H63","v":5.9485333009515284E-7},{"$f":"'Identify Toxic Air Contaminants'!$E63*VLOOKUP($B63,'Calculate Dispersion Factors'!$B$7:$N$11,4,FALSE)/I63","v":1.0240612665257017E-7},{"$f":"'Identify Toxic Air Contaminants'!$E63*VLOOKUP($B63,'Calculate Dispersion Factors'!$B$7:$N$11,5,FALSE)/J63","v":4.4144537379503939E-6},{"$f":"'Identify Toxic Air Contaminants'!$F63*VLOOKUP($B63,'Calculate Dispersion Factors'!$B$7:$N$11,6,FALSE)/K63","v":8.8824160060577631E-6}]
[null,"CIA-1","Nickel compounds, insoluble","365",3.8E-3,0.1,4.5999999999999999E-2,1.4E-2,6.2E-2,6.2E-2,0.2,{"$f":"'Identify Toxic Air Contaminants'!$E64*VLOOKUP($B64,'Calculate Dispersion Factors'!$B$7:$N$11,3,FALSE)/E64","v":4.0052193210157365E-6},{"$f":"'Identify Toxic Air Contaminants'!$E64*VLOOKUP($B64,'Calculate Dispersion Factors'!$B$7:$N$11,4,FALSE)/F64","v":1.1330372824259725E-7},{"$f":"'Identify Toxic Air Contaminants'!$E64*VLOOKUP($B64,'Calculate Dispersion Factors'!$B$7:$N$11,5,FALSE)/G64","v":1.0617869878234347E-5},{"$f":"'Identify Toxic Air Contaminants'!$E64*VLOOKUP($B64,'Calculate Dispersion Factors'!$B$7:$N$11,3,FALSE)/H64","v":1.0871309585614143E-6},{"$f":"'Identify Toxic Air Contaminants'!$E64*VLOOKUP($B64,'Calculate Dispersion Factors'!$B$7:$N$11,4,FALSE)/I64","v":1.8274794877838269E-7},{"$f":"'Identify Toxic Air Contaminants'!$E64*VLOOKUP($B64,'Calculate Dispersion Factors'!$B$7:$N$11,5,FALSE)/J64","v":7.8777744257867726E-6},{"$f":"'Identify Toxic Air Contaminants'!$F64*VLOOKUP($B64,'Calculate Dispersion Factors'!$B$7:$N$11,6,FALSE)/K64","v":6.1422768477422331E-5}]
[null,"CIA-1","Perylene","NoRBC","--","--","--","--","--","--","--"]
[null,"CIA-1","Phenanthrene","NoRBC","--","--","--","--","--","--","--"]
[null,"CIA-1","Phosphorus and compounds","NoRBC","--","--","--","--","--","--","--"]
[null,"CIA-1","Propylene","115-07-1","--","--","--",3000,13000,13000,"--","--","--","--",{"$f":"'Identify Toxic Air Contaminants'!$E68*VLOOKUP($B68,'Calculate Dispersion Factors'!$B$7:$N$11,3,FALSE)/H68","v":1.3084833384574816E-8},{"$f":"'Identify Toxic Air Contaminants'!$E68*VLOOKUP($B68,'Calculate Dispersion Factors'!$B$7:$N$11,4,FALSE)/I68","v":2.2479176677013139E-9},{"$f":"'Identify Toxic Air Contaminants'!$E68*VLOOKUP($B68,'Calculate Dispersion Factors'!$B$7:$N$11,5,FALSE)/J68","v":9.6901707692307701E-8},"--"]
[null,"CIA-1","Pyrene","NoRBC","--","--","--","--","--","--","--"]
[null,"CIA-1","Selenium and compounds","7782-49-2","--","--","--","--","--","--",2,"--","--","--","--","--","--",{"$f":"'Identify Toxic Air Contaminants'!$F70*VLOOKUP($B70,'Calculate Dispersion Factors'!$B$7:$N$11,6,FALSE)/K70","v":1.2686467512290325E-5}]
[null,"CIA-1","Silver and compounds","NoRBC","--","--","--","--","--","--","--"]
[null,"CIA-1","Thallium and compounds","NoRBC","--","--","--","--","--","--","--"]
[null,"CIA-1","Toluene","108-88-3","--","--","--",5000,22000,22000,7500,"--","--","--",{"$f":"'Identify Toxic Air Contaminants'!$E73*VLOOKUP($B73,'Calculate Dispersion Factors'!$B$7:$N$11,3,FALSE)/H73","v":1.7606060920010878E-9},{"$f":"'Identify Toxic Air Contaminants'!$E73*VLOOKUP($B73,'Calculate Dispersion Factors'!$B$7:$N$11,4,FALSE)/I73","v":2.97881700994617E-10},{"$f":"'Identify Toxic Air Contaminants'!$E73*VLOOKUP($B73,'Calculate Dispersion Factors'!$B$7:$N$11,5,FALSE)/J73","v":1.2840881999999999E-8},{"$f":"'Identify Toxic Air Contaminants'!$F73*VLOOKUP($B73,'Calculate Dispersion Factors'!$B$7:$N$11,6,FALSE)/K73","v":9.473717386666667E-7}]
[null,"CIA-1","Xylene (mixture), including m-xylene, o-xylene, p-xylene","1330-20-7","--","--","--",220,970,970,8700,"--","--","--",{"$f":"'Identify Toxic Air Contaminants'!$E74*VLOOKUP($B74,'Calculate Dispersion Factors'!$B$7:$N$11,3,FALSE)/H74","v":1.609662288702047E-8},{"$f":"'Identify Toxic Air Contaminants'!$E74*VLOOKUP($B74,'Calculate Dispersion Factors'!$B$7:$N$11,4,FALSE)/I74","v":2.7178157895085853E-9},{"$f":"'Identify Toxic Air Contaminants'!$E74*VLOOKUP($B74,'Calculate Dispersion Factors'!$B$7:$N$11,5,FALSE)/J74","v":1.1715775670103092E-7},{"$f":"'Identify Toxic Air Contaminants'!$F74*VLOOKUP($B74,'Calculate Dispersion Factors'!$B$7:$N$11,6,FALSE)/K74","v":3.2853956781609197E-7}]
[null,"CIA-1","Zinc and compounds","NoRBC","--","--","--","--","--","--","--"]

{"sheet":"Summarize Risk","index":6,"n_rows":12,"n_cols":9,"rows_kept":12,"cut":false,"hidden":false,"merged":[[4,2,4,4],[4,5,4,7],[4,8,5,8],[4,1,5,1]]}
[]
[null,"Summary of Risk"]
[]
[]
[null,"TEU Identifier","Cancer Risk",null,null,"Chronic Risk",null,null,"Acute"]
[null,null,"Residential","Child","Worker","Residential","Child","Worker"]
[null,"EU-2",{"$f":"SUMIF('Calculate Risk'!$B$7:$B$75,$B7,'Calculate Risk'!L$7:L$75)","v":1.9429234069557908E-2},{"$f":"SUMIF('Calculate Risk'!$B$7:$B$75,$B7,'Calculate Risk'!M$7:M$75)","v":6.4108902395370779E-4},{"$f":"SUMIF('Calculate Risk'!$B$7:$B$75,$B7,'Calculate Risk'!N$7:N$75)","v":8.5616824466566033E-3},{"$f":"SUMIF('Calculate Risk'!$B$7:$B$75,$B7,'Calculate Risk'!O$7:O$75)","v":4.3093127699938656E-3},{"$f":"SUMIF('Calculate Risk'!$B$7:$B$75,$B7,'Calculate Risk'!P$7:P$75)","v":5.8851186894011279E-4},{"$f":"SUMIF('Calculate Risk'!$B$7:$B$75,$B7,'Calculate Risk'!Q$7:Q$75)","v":1.1321116167292521E-2},{"$f":"SUMIF('Calculate Risk'!$B$7:$B$75,$B7,'Calculate Risk'!R$7:R$75)","v":4.3370999631807641E-2}]
[null,"EU-3",{"$f":"SUMIF('Calculate Risk'!$B$7:$B$75,$B8,'Calculate Risk'!L$7:L$75)","v":0},{"$f":"SUMIF('Calculate Risk'!$B$7:$B$75,$B8,'Calculate Risk'!M$7:M$75)","v":0},{"$f":"SUMIF('Calculate Risk'!$B$7:$B$75,$B8,'Calculate Risk'!N$7:N$75)","v":0},{"$f":"SUMIF('Calculate Risk'!$B$7:$B$75,$B8,'Calculate Risk'!O$7:O$75)","v":3.3615956765315003E-3},{"$f":"SUMIF('Calculate Risk'!$B$7:$B$75,$B8,'Calculate Risk'!P$7:P$75)","v":5.1509462256345328E-4},{"$f":"SUMIF('Calculate Risk'!$B$7:$B$75,$B8,'Calculate Risk'!Q$7:Q$75)","v":1.909128923181818E-2},{"$f":"SUMIF('Calculate Risk'!$B$7:$B$75,$B8,'Calculate Risk'!R$7:R$75)","v":2.5650800027618204E-2}]
[null,"EU-4A",{"$f":"SUMIF('Calculate Risk'!$B$7:$B$75,$B9,'Calculate Risk'!L$7:L$75)","v":0},{"$f":"SUMIF('Calculate Risk'!$B$7:$B$75,$B9,'Calculate Risk'!M$7:M$75)","v":0},{"$f":"SUMIF('Calculate Risk'!$B$7:$B$75,$B9,'Calculate Risk'!N$7:N$75)","v":0},{"$f":"SUMIF('Calculate Risk'!$B$7:$B$75,$B9,'Calculate Risk'!O$7:O$75)","v":0},{"$f":"SUMIF('Calculate Risk'!$B$7:$B$75,$B9,'Calculate Risk'!P$7:P$75)","v":0},{"$f":"SUMIF('Calculate Risk'!$B$7:$B$75,$B9,'Calculate Risk'!Q$7:Q$75)","v":0},{"$f":"SUMIF('Calculate Risk'!$B$7:$B$75,$B9,'Calculate Risk'!R$7:R$75)","v":5.4120489736534591E-3}]
[null,"EU-4B",{"$f":"SUMIF('Calculate Risk'!$B$7:$B$75,$B10,'Calculate Risk'!L$7:L$75)","v":0},{"$f":"SUMIF('Calculate Risk'!$B$7:$B$75,$B10,'Calculate Risk'!M$7:M$75)","v":0},{"$f":"SUMIF('Calculate Risk'!$B$7:$B$75,$B10,'Calculate Risk'!N$7:N$75)","v":0},{"$f":"SUMIF('Calculate Risk'!$B$7:$B$75,$B10,'Calculate Risk'!O$7:O$75)","v":0},{"$f":"SUMIF('Calculate Risk'!$B$7:$B$75,$B10,'Calculate Risk'!P$7:P$75)","v":0},{"$f":"SUMIF('Calculate Risk'!$B$7:$B$75,$B10,'Calculate Risk'!Q$7:Q$75)","v":0},{"$f":"SUMIF('Calculate Risk'!$B$7:$B$75,$B10,'Calculate Risk'!R$7:R$75)","v":1.4214173718873393E-2}]
[null,"CIA-1",{"$f":"SUMIF('Calculate Risk'!$B$7:$B$75,$B11,'Calculate Risk'!L$7:L$75)","v":1.7765945200163884E-2},{"$f":"SUMIF('Calculate Risk'!$B$7:$B$75,$B11,'Calculate Risk'!M$7:M$75)","v":4.9616895878290958E-4},{"$f":"SUMIF('Calculate Risk'!$B$7:$B$75,$B11,'Calculate Risk'!N$7:N$75)","v":4.5437045742815485E-2},{"$f":"SUMIF('Calculate Risk'!$B$7:$B$75,$B11,'Calculate Risk'!O$7:O$75)","v":4.7298344028641573E-4},{"$f":"SUMIF('Calculate Risk'!$B$7:$B$75,$B11,'Calculate Risk'!P$7:P$75)","v":6.4091638896005945E-5},{"$f":"SUMIF('Calculate Risk'!$B$7:$B$75,$B11,'Calculate Risk'!Q$7:Q$75)","v":2.7628188287574431E-3},{"$f":"SUMIF('Calculate Risk'!$B$7:$B$75,$B11,'Calculate Risk'!R$7:R$75)","v":5.8378496763476888E-3}]
[null,"Total Risk",{"$f":"SUM(C7:C11)","v":3.7195179269721795E-2},1.1372579827366174E-3,5.3998728189472087E-2,8.1438918868117823E-3,1.1676981303995722E-3,3.3175224227868144E-2,9.4485872028300388E-2]

{"sheet":"RBCs","index":7,"n_rows":265,"n_cols":10,"rows_kept":265,"cut":false,"hidden":false,"merged":[[1,1,3,1],[1,2,3,2],[1,3,1,4],[1,5,1,8],[1,0,3,0]]}
[]
[null,"CAS#","Chemical","Residential",null,"Non-Residential",null,null,null,"Acute "]
[null,null,null,"Cancer","Noncancer","Child Cancer","Child Noncancer","Worker Cancer","Worker Noncancer","Acute "]
[null,null,null,"(µg/m3)","(µg/m3)","(µg/m3)","(µg/m3)","(µg/m3)","(µg/m3)","(µg/m3)"]
[null,"75-07-0","Acetaldehyde",0.45,140,12,620,5.5,620,470]
[null,"60-35-5","Acetamide",0.05,"--",1.3,"--",0.6,"--","--"]
[null,"67-64-1","Acetone","--",31000,"--",140000,"--",140000,62000]
[null,"75-05-8","Acetonitrile","--",60,"--",260,"--",260,"--"]
[null,"107-02-8","Acrolein","--",0.35,"--",1.5,"--",1.5,6.9]
[null,"79-06-1","Acrylamide",5.8999999999999999E-3,6,6.2E-2,26,0.12,26,"--"]
[null,"79-10-7","Acrylic acid","--",1,"--",4.4000000000000004,"--",4.4000000000000004,6000]
[null,"107-13-1","Acrylonitrile",1.4999999999999999E-2,5,0.38,22,0.18,22,220]
[null,"309-00-2","Aldrin",2.0000000000000001E-4,"--",5.3E-3,"--",2.3999999999999998E-3,"--","--"]
[null,"107-05-1","Allyl chloride",0.17,1,4.3,4.4000000000000004,2,4.4000000000000004,"--"]
[null,"7429-90-5","Aluminum and compounds","--",5,"--",22,"--",22,"--"]
[null,"7664-41-7","Ammonia","--",500,"--",2200,"--",2200,1200]
[null,"62-53-3","Aniline",0.63,1,16,4.4000000000000004,7.5,4.4000000000000004,"--"]
[null,"7440-36-0","Antimony and compounds","--",0.3,"--",1.3,"--",1.3,1]
[null,"140-57-8","Aramite",0.14000000000000001,"--",3.7,"--",1.7,"--","--"]
[null,"7440-38-2","Arsenic and compounds",2.4000000000000001E-5,1.7000000000000001E-4,1.2999999999999999E-3,2.3999999999999998E-3,6.2E-4,2.3999999999999998E-3,0.2]
[null,"7784-42-1","Arsine","--",1.4999999999999999E-2,"--",6.6000000000000003E-2,"--",6.6000000000000003E-2,0.2]
[null,"1332-21-4","Asbestos",4.3000000000000003E-6,"--",1.1E-4,"--",5.1999999999999997E-5,"--","--"]
[null,"103-33-3","Azobenzene",3.2000000000000001E-2,"--",0.84,"--",0.39,"--","--"]
[null,"71-43-2","Benzene",0.13,3,3.3,13,1.5,13,29]
[null,"92-87-5","Benzidine (and its salts)",4.1999999999999996E-6,"--",4.3999999999999999E-5,"--",8.6000000000000003E-5,"--","--"]
[null,"100-44-7","Benzyl chloride",0.02,1,0.53,4.4000000000000004,0.24,4.4000000000000004,240]
[null,"7440-41-7","Beryllium and compounds",4.2000000000000002E-4,7.0000000000000001E-3,1.0999999999999999E-2,3.1E-2,5.0000000000000001E-3,3.1E-2,0.02]
[null,"111-44-4","Bis(2-chloroethyl) ether (DCEE)",1.4E-3,"--",3.6999999999999998E-2,"--",1.7000000000000001E-2,"--",120]
[null,"542-88-1","Bis(chloromethyl) ether",7.7000000000000001E-5,"--",2E-3,"--",9.2000000000000003E-4,"--",1.4]
[null,"117-81-7","Bis(2-ethylhexyl) phthalate (DEHP)",0.08,"--",11,"--",5,"--","--"]
[null,"75-25-2","Bromoform",0.91,"--",24,"--",11,"--","--"]
[null,"74-83-9","Bromomethane (Methyl bromide)","--",5,"--",22,"--",22,3900]
[null,"106-94-5","1-Bromopropane (n-propyl bromide)",0.48,33,12,150,5.7,150,1700]
[null,"106-99-0","1,3-Butadiene",3.3000000000000002E-2,2,0.86,8.8000000000000007,0.4,8.8000000000000007,660]
[null,"78-93-3","2-Butanone (Methyl ethyl ketone)","--",5000,"--",22000,"--",22000,5000]
[null,"78-92-2","sec-Butyl alcohol","--",30000,"--",130000,"--",130000,"--"]
[null,"7440-43-9","Cadmium and compounds",5.5999999999999995E-4,5.0000000000000001E-3,1.4E-2,3.6999999999999998E-2,6.7000000000000002E-3,3.6999999999999998E-2,0.03]
[null,"105-60-2","Caprolactam","--",2.2000000000000002,"--",9.6999999999999993,"--",9.6999999999999993,50]
[null,"75-15-0","Carbon disulfide","--",800,"--",3500,"--",3500,6200]
[null,"56-23-5","Carbon tetrachloride",0.17,100,4.3,440,2,440,1900]
[null,"463-58-1","Carbonyl sulfide","--",10,"--",44,"--",44,660]
[null,"57-74-9","Chlordane",0.01,0.02,0.26,8.7999999999999995E-2,0.12,8.7999999999999995E-2,0.2]
[null,"108171-26-2","Chlorinated paraffins",0.04,"--",1,"--",0.48,"--","--"]
[null,"7782-50-5","Chlorine","--",0.15,"--",0.66,"--",0.66,170]
[null,"10049-04-4","Chlorine dioxide","--",0.6,"--",2.6,"--",2.6,2.8]
[null,"532-27-4","2-Chloroacetophenone","--",0.03,"--",0.13,"--",0.13,"--"]
[null,"108-90-7","Chlorobenzene","--",50,"--",220,"--",220,"--"]
[null,"75-68-3","1-Chloro-1,1-difluoroethane","--",50000,"--",220000,"--",220000,"--"]
[null,"75-45-6","Chlorodifluoromethane (Freon 22)","--",50000,"--",220000,"--",220000,"--"]
[null,"75-00-3","Chloroethane (Ethyl chloride)","--",30000,"--",130000,"--",130000,40000]
[null,"67-66-3","Chloroform","--",300,"--",1300,"--",1300,490]
[null,"74-87-3","Chloromethane (Methyl chloride)","--",90,"--",400,"--",400,1000]
[null,"95-83-0","4-Chloro-o-phenylenediamine",0.22,"--",5.7,"--",2.6,"--","--"]
[null,"76-06-2","Chloropicrin","--",0.4,"--",1.8,"--",1.8,29]
[null,"126-99-8","Chloroprene",3.3E-3,20,8.6999999999999994E-2,88,0.04,88,"--"]
[null,"95-69-2","p-Chloro-o-toluidine",1.2999999999999999E-2,"--",0.34,"--",0.16,"--","--"]
[null,"18540-29-9","Chromium VI, chromate and dichromate particulate",3.1000000000000001E-5,8.3000000000000004E-2,5.1999999999999995E-4,0.88,1E-3,0.88,0.3]
[null,"7738-94-5","Chromium VI, chromic acid aerosol mist",3.1000000000000001E-5,2.0999999999999999E-3,5.1999999999999995E-4,2.1999999999999999E-2,1E-3,2.1999999999999999E-2,5.0000000000000001E-3]
[null,"7440-48-4","Cobalt and compounds","--",0.1,"--",0.44,"--",0.44,"--"]
[null,"148","Coke Oven Emissions",9.5E-4,"--",0.01,"--",1.9E-2,"--","--"]
[null,"7440-50-8","Copper and compounds","--","--","--","--","--","--",100]
[null,"120-71-8","p-Cresidine",2.3E-2,"--",0.6,"--",0.28000000000000003,"--","--"]
[null,"1319-77-3","Cresols (mixture), including m-cresol, o-cresol, p-cresol","--",600,"--",2600,"--",2600,"--"]
[null,"135-20-6","Cupferron",1.6E-2,"--",0.41,"--",0.19,"--","--"]
[null,"74-90-8","Cyanide, Hydrogen","--",0.8,"--",3.5,"--",3.5,340]
[null,"110-82-7","Cyclohexane","--",6000,"--",26000,"--",26000,"--"]
[null,"50-29-3","DDT",0.01,"--",0.27,"--",0.12,"--","--"]
[null,"615-05-4","2,4-Diaminoanisole",0.15,"--",3.9,"--",1.8,"--","--"]
[null,"95-80-7","2,4-Diaminotoluene (2,4-Toluene diamine)",9.1E-4,"--",2.4E-2,"--",1.0999999999999999E-2,"--","--"]
[null,"333-41-5","Diazinon","--","--","--","--","--","--",10]
[null,"96-12-8","1,2-Dibromo-3-chloropropane (DBCP)",9.7999999999999997E-5,0.2,1E-3,0.88,2E-3,0.88,1.9]
[null,"106-46-7","p-Dichlorobenzene (1,4-Dichlorobenzene)",9.0999999999999998E-2,60,2.4,260,1.1000000000000001,260,12000]
[null,"91-94-1","3,3'-Dichlorobenzidine",2.8999999999999998E-3,"--",7.5999999999999998E-2,"--",3.5000000000000003E-2,"--","--"]
[null,"75-34-3","1,1-Dichloroethane (Ethylidene dichloride)",0.63,"--",16,"--",7.5,"--","--"]
[null,"156-60-5","trans-1,2-dichloroethene","--","--","--","--","--","--",790]
[null,"75-09-2","Dichloromethane (Methylene chloride)",59,600,620,2600,1200,2600,2100]
[null,"78-87-5","1,2-Dichloropropane (Propylene dichloride)","--",4,"--",18,"--",18,230]
[null,"542-75-6","1,3-Dichloropropene",0.25,32,6.5,140,3,140,36]
[null,"62-73-7","Dichlorovos (DDVP)","--",0.54,"--",2.4,"--",2.4,18]
[null,"60-57-1","Dieldrin",2.2000000000000001E-4,"--",5.7000000000000002E-3,"--",2.5999999999999999E-3,"--","--"]
[null,"200","Diesel Particulate Matter",0.1,5,2.6,22,1.2,22,"--"]
[null,"111-42-2","Diethanolamine","--",0.2,"--",0.88,"--",0.88,"--"]
[null,"112-34-5","Diethylene glycol monobutyl ether","--",0.1,"--",0.44,"--",0.44,"--"]
[null,"111-90-0","Diethylene glycol monoethyl ether","--",0.3,"--",1.3,"--",1.3,"--"]
[null,"75-37-6","1,1-Difluoroethane","--",40000,"--",180000,"--",180000,"--"]
[null,"60-11-7","4-Dimethylaminoazobenzene",7.6999999999999996E-4,"--",0.02,"--",9.1999999999999998E-3,"--","--"]
[null,"68-12-2","Dimethyl formamide","--",80,"--",350,"--",350,"--"]
[null,"57-14-7","1,1-Dimethylhydrazine","--","--","--","--","--","--",0.49]
[null,"121-14-2","2,4-Dinitrotoluene",1.0999999999999999E-2,"--",0.28999999999999998,"--",0.13,"--","--"]
[null,"123-91-1","1,4-Dioxane",0.2,30,5.2,130,2.4,130,7200]
[null,"122-66-7","1,2-Diphenylhydrazine (Hydrazobenzene)",4.4999999999999997E-3,"--",0.12,"--",5.5E-2,"--","--"]
[null,"1937-37-7","Direct Black 38",7.0999999999999998E-6,"--",1.9000000000000001E-4,"--",8.6000000000000003E-5,"--","--"]
[null,"2602-46-2","Direct Blue 6",7.0999999999999998E-6,"--",1.9000000000000001E-4,"--",8.6000000000000003E-5,"--","--"]
[null,"16071-86-6","Direct Brown 95 (technical grade)",7.0999999999999998E-6,"--",1.9000000000000001E-4,"--",8.6000000000000003E-5,"--","--"]
[null,"298-04-4","Disulfoton","--","--","--","--","--","--",6]
[null,"106-89-8","Epichlorohydrin",4.2999999999999997E-2,3,1.1000000000000001,13,0.52,13,1300]
[null,"106-88-7","1,2-Epoxybutane","--",20,"--",88,"--",88,"--"]
[null,"140-88-5","Ethyl acrylate","--",8,"--",35,"--",35,"--"]
[null,"100-41-4","Ethyl benzene",0.4,260,10,1100,4.8,1100,22000]
[null,"106-93-4","Ethylene dibromide (EDB, 1,2-Dibromoethane)",1.6999999999999999E-3,9,4.2999999999999997E-2,40,0.02,40,"--"]
[null,"107-06-2","Ethylene dichloride (EDC, 1,2-Dichloroethane)",3.7999999999999999E-2,7,1,31,0.46,31,"--"]
[null,"107-21-1","Ethylene glycol","--",400,"--",1800,"--",1800,2000]
[null,"111-76-2","Ethylene glycol monobutyl ether","--",82,"--",360,"--",360,29000]
[null,"110-80-5","Ethylene glycol monoethyl ether","--",70,"--",310,"--",310,370]
[null,"111-15-9","Ethylene glycol monoethyl ether acetate","--",60,"--",260,"--",260,140]
[null,"109-86-4","Ethylene glycol monomethyl ether","--",60,"--",260,"--",260,93]
[null,"110-49-6","Ethylene glycol monomethyl ether acetate","--",1,"--",4.4000000000000004,"--",4.4000000000000004,"--"]
[null,"75-21-8","Ethylene oxide",2.0000000000000001E-4,30,2.0999999999999999E-3,130,4.0000000000000001E-3,130,160]
[null,"96-45-7","Ethylene thiourea",7.6999999999999999E-2,"--",2,"--",0.92,"--","--"]
[null,"239","Fluorides","--",2.2999999999999998,"--",20,"--",20,240]
[null,"7782-41-4","Fluorine gas","--","--","--","--","--","--",16]
[null,"50-00-0","Formaldehyde",0.17,9,4.3,40,2,40,49]
[null,"111-30-8","Glutaraldehyde","--",0.08,"--",0.35,"--",0.35,4.0999999999999996]
[null,"76-44-8","Heptachlor",7.6999999999999996E-4,"--",0.02,"--",9.1999999999999998E-3,"--","--"]
[null,"1024-57-3","Heptachlor epoxide",3.8000000000000002E-4,"--",0.01,"--",4.5999999999999999E-3,"--","--"]
[null,"118-74-1","Hexachlorobenzene",2E-3,"--",5.0999999999999997E-2,"--",2.4E-2,"--","--"]
[null,"87-68-3","Hexachlorobutadiene",4.4999999999999998E-2,"--",1.2,"--",0.55000000000000004,"--","--"]
[null,"608-73-1","Hexachlorocyclohexanes (mixture) including but not limited to:",1.7000000000000001E-4,"--",1.7999999999999999E-2,"--",8.3999999999999995E-3,"--","--"]
[null,"319-84-6","Hexachlorocyclohexane, alpha-",1.7000000000000001E-4,"--",1.7999999999999999E-2,"--",8.3999999999999995E-3,"--","--"]
[null,"319-85-7","Hexachlorocyclohexane, beta-",1.7000000000000001E-4,"--",1.7999999999999999E-2,"--",8.3999999999999995E-3,"--","--"]
[null,"58-89-9","Hexachlorocyclohexane, gamma- (Lindane)",5.9999999999999995E-4,"--",6.5000000000000002E-2,"--",0.03,"--","--"]
[null,"77-47-4","Hexachlorocyclopentadiene","--",0.2,"--",0.88,"--",0.88,110]
[null,"67-72-1","Hexachloroethane","--",30,"--",130,"--",130,58000]
[null,"822-06-0","Hexamethylene-1,6-diisocyanate","--",6.9000000000000006E-2,"--",0.3,"--",0.3,0.21]
[null,"110-54-3","Hexane","--",700,"--",3100,"--",3100,"--"]
[null,"302-01-2","Hydrazine",2.0000000000000001E-4,0.03,5.3E-3,0.13,2.3999999999999998E-3,0.13,5.2]
[null,"7647-01-0","Hydrochloric acid","--",20,"--",88,"--",88,2100]
[null,"7664-39-3","Hydrogen fluoride","--",2.1,"--",19,"--",19,16]
[null,"7783-06-4","Hydrogen sulfide","--",2,"--",8.8000000000000007,"--",8.8000000000000007,98]
[null,"78-59-1","Isophorone","--",2000,"--",8800,"--",8800,"--"]
[null,"67-63-0","Isopropyl alcohol","--",200,"--",880,"--",880,3200]
[null,"98-82-8","Isopropylbenzene (Cumene)","--",400,"--",1800,"--",1800,"--"]
[null,"7439-92-1","Lead and compounds","--",0.15,"--",0.66,"--",0.66,0.15]
[null,"108-31-6","Maleic anhydride","--",0.7,"--",3.1,"--",3.1,"--"]
[null,"7439-96-5","Manganese and compounds","--",0.09,"--",0.4,"--",0.4,0.3]
[null,"7439-97-6","Mercury and compounds","--",7.6999999999999999E-2,"--",0.63,"--",0.63,0.6]
[null,"67-56-1","Methanol","--",4000,"--",18000,"--",18000,28000]
[null,"101-14-4","4,4'-Methylene bis(2-chloroaniline) (MOCA)",2.3E-3,"--",0.06,"--",2.8000000000000001E-2,"--","--"]
[null,"101-77-9","4,4'-Methylenedianiline (and its dichloride)",2.9999999999999997E-4,20,2.3E-2,88,0.01,88,"--"]
[null,"101-68-8","Methylene diphenyl diisocyanate (MDI)","--",0.08,"--",0.35,"--",0.35,12]
[null,"108-10-1","Methyl isobutyl ketone (MIBK, Hexone)","--",3000,"--",13000,"--",13000,"--"]
[null,"624-83-9","Methyl isocyanate","--",1,"--",4.4000000000000004,"--",4.4000000000000004,"--"]
[null,"80-62-6","Methyl methacrylate","--",700,"--",3100,"--",3100,"--"]
[null,"1634-04-4","Methyl tert-butyl ether",3.8,8000,100,35000,46,35000,8000]
[null,"90-94-8","Michler's ketone",4.0000000000000001E-3,"--",0.1,"--",4.8000000000000001E-2,"--","--"]
[null,"91-20-3","Naphthalene",2.9000000000000001E-2,3.7,0.76,16,0.35,16,200]
[null,"365","Nickel compounds, insoluble",3.8E-3,1.4E-2,0.1,6.2E-2,4.5999999999999999E-2,6.2E-2,0.2]
[null,"368","Nickel compounds, soluble","--",1.4E-2,"--",6.2E-2,"--",6.2E-2,0.2]
[null,"7697-37-2","Nitric acid","--","--","--","--","--","--",86]
[null,"98-95-3","Nitrobenzene",2.5000000000000001E-2,9,0.65,40,0.3,40,"--"]
[null,"79-46-9","2-Nitropropane","--",20,"--",88,"--",88,"--"]
[null,"924-16-3","N-Nitrosodi-n-butylamine",3.2000000000000003E-4,"--",8.3999999999999995E-3,"--",3.8999999999999998E-3,"--","--"]
[null,"55-18-5","N-Nitrosodiethylamine",5.8999999999999998E-5,"--",6.2E-4,"--",1.1999999999999999E-3,"--","--"]
[null,"62-75-9","N-Nitrosodimethylamine",1.2999999999999999E-4,"--",1.2999999999999999E-3,"--",2.5999999999999999E-3,"--","--"]
[null,"86-30-6","N-Nitrosodiphenylamine",0.38,"--",10,"--",4.5999999999999996,"--","--"]
[null,"156-10-5","p-Nitrosodiphenylamine",0.16,"--",4.0999999999999996,"--",1.9,"--","--"]
[null,"621-64-7","N-Nitrosodi-n-propylamine",5.0000000000000001E-4,"--",1.2999999999999999E-2,"--",6.0000000000000001E-3,"--","--"]
[null,"10595-95-6","N-Nitrosomethylethylamine",1.6000000000000001E-4,"--",4.1000000000000003E-3,"--",1.9E-3,"--","--"]
[null,"59-89-2","N-Nitrosomorpholine",5.2999999999999998E-4,"--",1.4E-2,"--",6.3E-3,"--","--"]
[null,"100-75-4","N-Nitrosopiperidine",3.6999999999999999E-4,"--",9.5999999999999992E-3,"--",4.4000000000000003E-3,"--","--"]
[null,"930-55-2","N-Nitrosopyrrolidine",1.6999999999999999E-3,"--",4.2999999999999997E-2,"--",0.02,"--","--"]
[null,"8014-95-7","Oleum (fuming sulfuric acid)","--","--","--","--","--","--",120]
[null,"56-38-2","Parathion","--","--","--","--","--","--",0.02]
[null,"87-86-5","Pentachlorophenol",0.2,"--",5.0999999999999996,"--",2.4,"--","--"]
[null,"108-95-2","Phenol","--",200,"--",880,"--",880,5800]
[null,"75-44-5","Phosgene","--",0.3,"--",1.3,"--",1.3,4]
[null,"7803-51-2","Phosphine","--",0.8,"--",3.5,"--",3.5,"--"]
[null,"7664-38-2","Phosphoric acid","--",10,"--",44,"--",44,"--"]
[null,"12185-10-3","Phosphorus, white","--",9,"--",40,"--",40,20]
[null,"85-44-9","Phthalic anhydride","--",20,"--",88,"--",88,"--"]
[null,"447","Polybrominated diphenyl ethers (PBDEs)","--","--","--","--","--","--",6]
[null,"1336-36-3","Polychlorinated biphenyls (PCBs)",5.2999999999999998E-4,"--",0.02,"--",9.1999999999999998E-3,"--","--"]
[null,"645","Polychlorinated biphenyls (PCBs) TEQ",1.0000000000000001E-9,1.3E-7,8.9999999999999999E-8,2.5999999999999998E-5,4.1999999999999999E-8,2.5999999999999998E-5,"--"]
[null,"32598-13-3","PCB 77 [3,3',4,4'-tetrachlorobiphenyl]",1.0000000000000001E-5,1.2999999999999999E-3,8.9999999999999998E-4,0.26,4.2000000000000002E-4,0.26,"--"]
[null,"70362-50-4","PCB 81 [3,4,4',5-tetrachlorobiphenyl]",3.4000000000000001E-6,4.2000000000000002E-4,2.9999999999999997E-4,8.5000000000000006E-2,1.3999999999999999E-4,8.5000000000000006E-2,"--"]
[null,"32598-14-4","PCB 105 [2,3,3',4,4'-pentachlorobiphenyl]",3.4E-5,4.1999999999999997E-3,3.0000000000000001E-3,0.85,1.4E-3,0.85,"--"]
[null,"74472-37-0","PCB 114 [2,3,4,4',5-pentachlorobiphenyl]",3.4E-5,4.1999999999999997E-3,3.0000000000000001E-3,0.85,1.4E-3,0.85,"--"]
[null,"31508-00-6","PCB 118 [2,3',4,4',5-pentachlorobiphenyl]",3.4E-5,4.1999999999999997E-3,3.0000000000000001E-3,0.85,1.4E-3,0.85,"--"]
[null,"65510-44-3","PCB 123 [2,3',4,4',5'-pentachlorobiphenyl]",3.4E-5,4.1999999999999997E-3,3.0000000000000001E-3,0.85,1.4E-3,0.85,"--"]
[null,"57465-28-8","PCB 126 [3,3',4,4',5-pentachlorobiphenyl]",1E-8,1.3E-6,8.9999999999999996E-7,2.5999999999999998E-4,4.2E-7,2.5999999999999998E-4,"--"]
[null,"38380-08-4","PCB 156 [2,3,3',4,4',5-hexachlorobiphenyl]",3.4E-5,4.1999999999999997E-3,3.0000000000000001E-3,0.85,1.4E-3,0.85,"--"]
[null,"69782-90-7","PCB 157 [2,3,3',4,4',5'-hexachlorobiphenyl]",3.4E-5,4.1999999999999997E-3,3.0000000000000001E-3,0.85,1.4E-3,0.85,"--"]
[null,"52663-72-6","PCB 167 [2,3',4,4',5,5'-hexachlorobiphenyl]",3.4E-5,4.1999999999999997E-3,3.0000000000000001E-3,0.85,1.4E-3,0.85,"--"]
[null,"32774-16-6","PCB 169 [3,3',4,4',5,5'-hexachlorobiphenyl]",3.4E-8,4.1999999999999996E-6,3.0000000000000001E-6,8.4999999999999995E-4,1.3999999999999999E-6,8.4999999999999995E-4,"--"]
[null,"39635-31-9","PCB 189 [2,3,3',4,4',5,5'-heptachlorobiphenyl]",8.8000000000000003E-4,1.3,2.3E-2,5.7,1.0999999999999999E-2,5.7,"--"]
[null,"646","Polychlorinated dibenzo-p-dioxins (PCDDs) & dibenzofurans (PCDFs) TEQ",1.0000000000000001E-9,1.3E-7,8.9999999999999999E-8,2.5999999999999998E-5,4.1999999999999999E-8,2.5999999999999998E-5,"--"]
[null,"1746-01-6","2,3,7,8-Tetrachlorodibenzo-p-dioxin (TCDD)",1.0000000000000001E-9,1.3E-7,8.9999999999999999E-8,2.5999999999999998E-5,4.1999999999999999E-8,2.5999999999999998E-5,"--"]
[null,"40321-76-4","1,2,3,7,8-Pentachlorodibenzo-p-dioxin (PeCDD)",1.0000000000000001E-9,1.3E-7,8.9999999999999999E-8,2.5999999999999998E-5,4.1999999999999999E-8,2.5999999999999998E-5,"--"]
[null,"39227-28-6","1,2,3,4,7,8-Hexachlorodibenzo-p-dioxin (HxCDD)",1E-8,1.3E-6,8.9999999999999996E-7,2.5999999999999998E-4,4.2E-7,2.5999999999999998E-4,"--"]
[null,"57653-85-7","1,2,3,6,7,8-Hexachlorodibenzo-p-dioxin (HxCDD)",1E-8,1.3E-6,8.9999999999999996E-7,2.5999999999999998E-4,4.2E-7,2.5999999999999998E-4,"--"]
[null,"19408-74-3","1,2,3,7,8,9-Hexachlorodibenzo-p-dioxin (HxCDD)",1E-8,1.3E-6,8.9999999999999996E-7,2.5999999999999998E-4,4.2E-7,2.5999999999999998E-4,"--"]
[null,"35822-46-9","1,2,3,4,6,7,8-Heptachlorodibenzo-p-dioxin (HpCDD)",9.9999999999999995E-8,1.2999999999999999E-5,9.0000000000000002E-6,2.5999999999999999E-3,4.1999999999999996E-6,2.5999999999999999E-3,"--"]
[null,"3268-87-9","Octachlorodibenzo-p-dioxin (OCDD)",3.4000000000000001E-6,4.2000000000000002E-4,2.9999999999999997E-4,8.5000000000000006E-2,1.3999999999999999E-4,8.5000000000000006E-2,"--"]
[null,"51207-31-9","2,3,7,8-Tetrachlorodibenzofuran (TcDF)",1E-8,1.3E-6,8.9999999999999996E-7,2.5999999999999998E-4,4.2E-7,2.5999999999999998E-4,"--"]
[null,"57117-41-6","1,2,3,7,8-Pentachlorodibenzofuran (PeCDF)",3.4E-8,4.1999999999999996E-6,3.0000000000000001E-6,8.4999999999999995E-4,1.3999999999999999E-6,8.4999999999999995E-4,"--"]
[null,"57117-31-4","2,3,4,7,8-Pentachlorodibenzofuran (PeCDF)",3.3999999999999998E-9,4.2E-7,2.9999999999999999E-7,8.5000000000000006E-5,1.4000000000000001E-7,8.5000000000000006E-5,"--"]
[null,"70648-26-9","1,2,3,4,7,8-Hexachlorodibenzofuran (HxCDF)",1E-8,1.3E-6,8.9999999999999996E-7,2.5999999999999998E-4,4.2E-7,2.5999999999999998E-4,"--"]
[null,"57117-44-9","1,2,3,6,7,8-Hexachlorodibenzofuran (HxCDF)",1E-8,1.3E-6,8.9999999999999996E-7,2.5999999999999998E-4,4.2E-7,2.5999999999999998E-4,"--"]
[null,"72918-21-9","1,2,3,7,8,9-Hexachlorodibenzofuran (HxCDF)",1E-8,1.3E-6,8.9999999999999996E-7,2.5999999999999998E-4,4.2E-7,2.5999999999999998E-4,"--"]
[null,"60851-34-5","2,3,4,6,7,8-Hexachlorodibenzofuran  (HxCDF)",1E-8,1.3E-6,8.9999999999999996E-7,2.5999999999999998E-4,4.2E-7,2.5999999999999998E-4,"--"]
[null,"67562-39-4","1,2,3,4,6,7,8-Heptachlorodibenzofuran (HpCDF)",9.9999999999999995E-8,1.2999999999999999E-5,9.0000000000000002E-6,2.5999999999999999E-3,4.1999999999999996E-6,2.5999999999999999E-3,"--"]
[null,"55673-89-7","1,2,3,4,7,8,9-Heptachlorodibenzofuran (HpCDF)",9.9999999999999995E-8,1.2999999999999999E-5,9.0000000000000002E-6,2.5999999999999999E-3,4.1999999999999996E-6,2.5999999999999999E-3,"--"]
[null,"39001-02-0","Octachlorodibenzofuran (OCDF)",3.4000000000000001E-6,4.2000000000000002E-4,2.9999999999999997E-4,8.5000000000000006E-2,1.3999999999999999E-4,8.5000000000000006E-2,"--"]
[null,"401","Polycyclic aromatic hydrocarbons (PAHs)",4.3000000000000002E-5,"--",1.6000000000000001E-3,"--",3.0000000000000001E-3,"--","--"]
[null,"191-26-4","Anthanthrene",1.1E-4,"--",3.8999999999999998E-3,"--",7.6E-3,"--","--"]
[null,"56-55-3","Benz[a]anthracene",2.1000000000000001E-4,"--",7.7999999999999996E-3,"--",1.4999999999999999E-2,"--","--"]
[null,"50-32-8","Benzo[a]pyrene",4.3000000000000002E-5,2E-3,1.6000000000000001E-3,8.8000000000000005E-3,3.0000000000000001E-3,8.8000000000000005E-3,2E-3]
[null,"205-99-2","Benzo[b]fluoranthene",5.3000000000000001E-5,"--",2E-3,"--",3.8E-3,"--","--"]
[null,"205-12-9","Benzo[c]fluorene",2.0999999999999998E-6,"--",7.7999999999999999E-5,"--",1.4999999999999999E-4,"--","--"]
[null,"191-24-2","Benzo[g,h,i]perylene",4.7000000000000002E-3,"--",0.17,"--",0.34,"--","--"]
[null,"205-82-3","Benzo[j]fluoranthene",1.3999999999999999E-4,"--",5.1999999999999998E-3,"--",0.01,"--","--"]
[null,"207-08-9","Benzo[k]fluoranthene",1.4E-3,"--",5.1999999999999998E-2,"--",0.1,"--","--"]
[null,"218-01-9","Chrysene",4.2999999999999999E-4,"--",1.6E-2,"--",0.03,"--","--"]
[null,"27208-37-3","Cyclopenta[c,d]pyrene",1.1E-4,"--",3.8999999999999998E-3,"--",7.6E-3,"--","--"]
[null,"53-70-3","Dibenz[a,h]anthracene",4.3000000000000003E-6,"--",1.6000000000000001E-4,"--",2.9999999999999997E-4,"--","--"]
[null,"192-65-4","Dibenzo[a,e]pyrene",1.1E-4,"--",3.8999999999999998E-3,"--",7.6E-3,"--","--"]
[null,"189-64-0","Dibenzo[a,h]pyrene",4.6999999999999997E-5,"--",1.6999999999999999E-3,"--",3.3999999999999998E-3,"--","--"]
[null,"189-55-9","Dibenzo[a,i]pyrene",7.1000000000000005E-5,"--",2.5999999999999999E-3,"--",5.1000000000000004E-3,"--","--"]
[null,"191-30-0","Dibenzo[a,l]pyrene",1.3999999999999999E-6,"--",5.1999999999999997E-5,"--",1E-4,"--","--"]
[null,"206-44-0","Fluoranthene",5.2999999999999998E-4,"--",0.02,"--",3.7999999999999999E-2,"--","--"]
[null,"193-39-5","Indeno[1,2,3-cd]pyrene",6.0999999999999997E-4,"--",2.1999999999999999E-2,"--",4.2999999999999997E-2,"--","--"]
[null,"3697-24-3","5-Methylchrysene",4.3000000000000002E-5,"--",1.6000000000000001E-3,"--",3.0000000000000001E-3,"--","--"]
[null,"7496-02-8","6-Nitrochrysene",4.3000000000000003E-6,"--",1.6000000000000001E-4,"--",2.9999999999999997E-4,"--","--"]
[null,"7758-01-2","Potassium bromate",7.1000000000000004E-3,"--",0.19,"--",8.5999999999999993E-2,"--","--"]
[null,"1120-71-4","1,3-Propane sultone",1.4E-3,"--",3.7999999999999999E-2,"--",1.7000000000000001E-2,"--","--"]
[null,"123-38-6","Propionaldehyde","--",8,"--",35,"--",35,"--"]
[null,"115-07-1","Propylene","--",3000,"--",13000,"--",13000,"--"]
[null,"6423-43-4","Propylene glycol dinitrate","--",0.27,"--",1.2,"--",1.2,20]
[null,"107-98-2","Propylene glycol monomethyl ether","--",7000,"--",31000,"--",31000,"--"]
[null,"75-56-9","Propylene oxide",0.27,30,7,130,3.2,130,3100]
[null,"572","Refractory Ceramic Fibers","--",0.03,"--",0.13,"--",0.13,"--"]
[null,"7783-07-5","Selenide, hydrogen","--","--","--","--","--","--",5]
[null,"7782-49-2","Selenium and compounds","--","--","--","--","--","--",2]
[null,"7631-86-9","Silica, crystalline (respirable)","--",3,"--",13,"--",13,"--"]
[null,"1310-73-2","Sodium hydroxide","--","--","--","--","--","--",8]
[null,"100-42-5","Styrene","--",1000,"--",4400,"--",4400,21000]
[null,"7664-93-9","Sulfuric acid","--",1,"--",4.4000000000000004,"--",4.4000000000000004,120]
[null,"505-60-2","Sulfur Mustard","--","--","--","--","--","--",0.7]
[null,"7446-71-9","Sulfur trioxide","--",1,"--",4.4000000000000004,"--",4.4000000000000004,120]
[null,"630-20-6","1,1,1,2-Tetrachloroethane",0.14000000000000001,"--",3.5,"--",1.6,"--","--"]
[null,"79-34-5","1,1,2,2-Tetrachloroethane",1.7000000000000001E-2,"--",0.45,"--",0.21,"--","--"]
[null,"127-18-4","Tetrachloroethene (Perchloroethylene)",3.8,41,100,180,46,180,41]
[null,"811-97-2","1,1,1,2-Tetrafluoroethane","--",80000,"--",350000,"--",350000,"--"]
[null,"62-55-5","Thioacetamide",5.9000000000000003E-4,"--",1.4999999999999999E-2,"--",7.1000000000000004E-3,"--","--"]
[null,"7550-45-0","Titanium tetrachloride","--",0.1,"--",0.44,"--",0.44,10]
[null,"108-88-3","Toluene","--",5000,"--",22000,"--",22000,7500]
[null,"26471-62-5","Toluene diisocyanates (2,4- and 2,6-)",9.0999999999999998E-2,2.1000000000000001E-2,2.4,9.1999999999999998E-2,1.1000000000000001,9.1999999999999998E-2,7.0999999999999994E-2]
[null,"8001-35-2","Toxaphene (Polychlorinated camphenes)",3.0999999999999999E-3,"--",8.1000000000000003E-2,"--",3.7999999999999999E-2,"--","--"]
[null,"71-55-6","1,1,1-Trichloroethane (Methyl chloroform)","--",5000,"--",22000,"--",22000,11000]
[null,"79-00-5","1,1,2-Trichloroethane (Vinyl trichloride)",6.3E-2,"--",1.6,"--",0.75,"--","--"]
[null,"79-01-6","Trichloroethene (TCE, Trichloroethylene)",0.2,2.1,3.5,9.1999999999999993,2.9,9.1999999999999993,2.1]
[null,"88-06-2","2,4,6-Trichlorophenol",0.05,"--",1.3,"--",0.6,"--","--"]
[null,"96-18-4","1,2,3-Trichloropropane","--",0.3,"--",1.3,"--",1.3,1.8]
[null,"121-44-8","Triethylamine","--",200,"--",880,"--",880,2800]
[null,"526-73-8","1,2,3-Trimethylbenzene","--",60,"--",260,"--",260,"--"]
[null,"95-63-6","1,2,4-Trimethylbenzene","--",60,"--",260,"--",260,"--"]
[null,"108-67-8","1,3,5-Trimethylbenzene","--",60,"--",260,"--",260,"--"]
[null,"51-79-6","Urethane (Ethyl carbamate)",2E-3,"--",2.1000000000000001E-2,"--",4.1000000000000002E-2,"--","--"]
[null,"7440-62-2","Vanadium (fume or dust)","--",0.1,"--",0.44,"--",0.44,0.8]
[null,"1314-62-1","Vanadium pentoxide",1.2E-4,7.0000000000000001E-3,3.0999999999999999E-3,3.1E-2,1.4E-3,3.1E-2,30]
[null,"108-05-4","Vinyl acetate","--",200,"--",880,"--",880,200]
[null,"593-60-2","Vinyl bromide","--",3,"--",13,"--",13,"--"]
[null,"75-01-4","Vinyl chloride",0.11,100,0.22,440,2.7,440,1300]
[null,"75-35-4","Vinylidene chloride","--",200,"--",880,"--",880,200]
[null,"1330-20-7","Xylene (mixture), including m-xylene, o-xylene, p-xylene","--",220,"--",970,"--",970,8700]

{"sheet":"TACs","index":8,"n_rows":610,"n_cols":4,"rows_kept":610,"cut":false,"hidden":false,"merged":[]}
[]
[null,"Chemical","CAS#","RBC?"]
[null,"Acetaldehyde","75-07-0"]
[null,"Acetamide","60-35-5"]
[null,"Acetone","67-64-1"]
[null,"Acetonitrile","75-05-8"]
[null,"Acetophenone","98-86-2",{"$f":"IFERROR(VLOOKUP(C7,RBCs!$B$5:$C$265,2,FALSE),\"NoRBC\")","v":"NoRBC"}]
[null,"Acrolein","107-02-8"]
[null,"Acrylamide","79-06-1"]
[null,"Acrylic acid","79-10-7"]
[null,"Acrylonitrile","107-13-1"]
[null,"Actinomycin D","50-76-0",{"$f":"IFERROR(VLOOKUP(C12,RBCs!$B$5:$C$265,2,FALSE),\"NoRBC\")","v":"NoRBC"}]
[null,"Alar","1596-84-5",{"$f":"IFERROR(VLOOKUP(C13,RBCs!$B$5:$C$265,2,FALSE),\"NoRBC\")","v":"NoRBC"}]
[null,"Aldrin","309-00-2"]
[null,"Allyl chloride","107-05-1"]
[null,"Aluminum and compounds","7429-90-5"]
[null,"Aluminum oxide (fibrous forms)","1344-28-1",{"$f":"IFERROR(VLOOKUP(C17,RBCs!$B$5:$C$265,2,FALSE),\"NoRBC\")","v":"NoRBC"}]
[null,"ortho-Aminoazotoluene","97-56-3",{"$f":"IFERROR(VLOOKUP(C18,RBCs!$B$5:$C$265,2,FALSE),\"NoRBC\")","v":"NoRBC"}]
[null,"3-Amino-9-ethylcarbazole hydrochloride","6109-97-3",{"$f":"IFERROR(VLOOKUP(C19,RBCs!$B$5:$C$265,2,FALSE),\"NoRBC\")","v":"NoRBC"}]
[null,"2-Amino-3-methyl-9H pyrido[2,3-b]indole","68006-83-7",{"$f":"IFERROR(VLOOKUP(C20,RBCs!$B$5:$C$265,2,FALSE),\"NoRBC\")","v":"NoRBC"}]
[null,"1-Amino-2-methylanthraquinone","82-28-0",{"$f":"IFERROR(VLOOKUP(C21,RBCs!$B$5:$C$265,2,FALSE),\"NoRBC\")","v":"NoRBC"}]
[null,"2-Amino-3-methylimidazo-[4,5-f]quinoline","76180-96-6",{"$f":"IFERROR(VLOOKUP(C22,RBCs!$B$5:$C$265,2,FALSE),\"NoRBC\")","v":"NoRBC"}]
[null,"2-Amino-5-(5-Nitro-2-Furyl)-1,3,4-Thiadiazol","712-68-5",{"$f":"IFERROR(VLOOKUP(C23,RBCs!$B$5:$C$265,2,FALSE),\"NoRBC\")","v":"NoRBC"}]
[null,"A-alpha-c(2-amino-9h-pyrido[2,3-b]indole)","26148-68-5",{"$f":"IFERROR(VLOOKUP(C24,RBCs!$B$5:$C$265,2,FALSE),\"NoRBC\")","v":"NoRBC"}]
[null,"4-Aminobiphenyl","92-67-1",{"$f":"IFERROR(VLOOKUP(C25,RBCs!$B$5:$C$265,2,FALSE),\"NoRBC\")","v":"NoRBC"}]
[null,"Amitrole","61-82-5",{"$f":"IFERROR(VLOOKUP(C26,RBCs!$B$5:$C$265,2,FALSE),\"NoRBC\")","v":"NoRBC"}]
[null,"Ammonia","7664-41-7"]
[null,"Ammonium bisulfate","7803-63-6",{"$f":"IFERROR(VLOOKUP(C28,RBCs!$B$5:$C$265,2,FALSE),\"NoRBC\")","v":"NoRBC"}]
[null,"Ammonium nitrate","6484-52-2",{"$f":"IFERROR(VLOOKUP(C29,RBCs!$B$5:$C$265,2,FALSE),\"NoRBC\")","v":"NoRBC"}]
[null,"Ammonium sulfate","7783-20-2",{"$f":"IFERROR(VLOOKUP(C30,RBCs!$B$5:$C$265,2,FALSE),\"NoRBC\")","v":"NoRBC"}]
[null,"Aniline","62-53-3"]
[null,"o-Anisidine","90-04-0",{"$f":"IFERROR(VLOOKUP(C32,RBCs!$B$5:$C$265,2,FALSE),\"NoRBC\")","v":"NoRBC"}]
[null,"o-Anisidine hydrochloride","134-29-2",{"$f":"IFERROR(VLOOKUP(C33,RBCs!$B$5:$C$265,2,FALSE),\"NoRBC\")","v":"NoRBC"}]
[null,"Antimony and compounds","7440-36-0"]
[null,"Antimony trioxide","1309-64-4",{"$f":"IFERROR(VLOOKUP(C35,RBCs!$B$5:$C$265,2,FALSE),\"NoRBC\")","v":"NoRBC"}]
[null,"Aramite","140-57-8"]
[null,"Arsenic and compounds","7440-38-2"]
[null,"Arsine","7784-42-1"]
[null,"Asbestos","1332-21-4"]
[null,"Auramine","492-80-8",{"$f":"IFERROR(VLOOKUP(C40,RBCs!$B$5:$C$265,2,FALSE),\"NoRBC\")","v":"NoRBC"}]
[null,"Azaserine","115-02-6",{"$f":"IFERROR(VLOOKUP(C41,RBCs!$B$5:$C$265,2,FALSE),\"NoRBC\")","v":"NoRBC"}]
[null,"Azathioprine","446-86-6",{"$f":"IFERROR(VLOOKUP(C42,RBCs!$B$5:$C$265,2,FALSE),\"NoRBC\")","v":"NoRBC"}]
[null,"Tris-(1-Aziridinyl)phosphine sulfide","52-24-4",{"$f":"IFERROR(VLOOKUP(C43,RBCs!$B$5:$C$265,2,FALSE),\"NoRBC\")","v":"NoRBC"}]
[null,"Azobenzene","103-33-3"]
[null,"Barium and compounds","7440-39-3",{"$f":"IFERROR(VLOOKUP(C45,RBCs!$B$5:$C$265,2,FALSE),\"NoRBC\")","v":"NoRBC"}]
[null,"Benzene","71-43-2"]
[null,"Benzidine (and its salts)","92-87-5"]
[null,"Benzofuran","271-89-6",{"$f":"IFERROR(VLOOKUP(C48,RBCs!$B$5:$C$265,2,FALSE),\"NoRBC\")","v":"NoRBC"}]
[null,"Benzoic trichloride (Benzotrichloride)","98-07-7",{"$f":"IFERROR(VLOOKUP(C49,RBCs!$B$5:$C$265,2,FALSE),\"NoRBC\")","v":"NoRBC"}]
[null,"Benzoyl chloride","98-88-4",{"$f":"IFERROR(VLOOKUP(C50,RBCs!$B$5:$C$265,2,FALSE),\"NoRBC\")","v":"NoRBC"}]
[null,"Benzoyl peroxide","94-36-0",{"$f":"IFERROR(VLOOKUP(C51,RBCs!$B$5:$C$265,2,FALSE),\"NoRBC\")","v":"NoRBC"}]
[null,"Benzyl chloride","100-44-7"]
[null,"Benzyl Violet 4B","1694-09-3",{"$f":"IFERROR(VLOOKUP(C53,RBCs!$B$5:$C$265,2,FALSE),\"NoRBC\")","v":"NoRBC"}]
[null,"Beryllium and compounds","7440-41-7"]
[null,"Beryllium Oxide","1304-56-9",{"$f":"IFERROR(VLOOKUP(C55,RBCs!$B$5:$C$265,2,FALSE),\"NoRBC\")","v":"NoRBC"}]
[null,"Beryllium Sulfate","13510-49-1",{"$f":"IFERROR(VLOOKUP(C56,RBCs!$B$5:$C$265,2,FALSE),\"NoRBC\")","v":"NoRBC"}]
[null,"Biphenyl","92-52-4",{"$f":"IFERROR(VLOOKUP(C57,RBCs!$B$5:$C$265,2,FALSE),\"NoRBC\")","v":"NoRBC"}]
[null,"Bis(2-chloroethyl) ether (DCEE)","111-44-4"]
[null,"Bis(chloromethyl) ether","542-88-1"]
[null,"Bis(2-ethylhexyl) adipate","103-23-1",{"$f":"IFERROR(VLOOKUP(C60,RBCs!$B$5:$C$265,2,FALSE),\"NoRBC\")","v":"NoRBC"}]
[null,"Bis(2-ethylhexyl) phthalate (DEHP)","117-81-7"]
[null,"Bromine and compounds","7726-95-6",{"$f":"IFERROR(VLOOKUP(C62,RBCs!$B$5:$C$265,2,FALSE),\"NoRBC\")","v":"NoRBC"}]
[null,"Bromine pentafluoride","7789-30-2",{"$f":"IFERROR(VLOOKUP(C63,RBCs!$B$5:$C$265,2,FALSE),\"NoRBC\")","v":"NoRBC"}]
[null,"Bromodichloromethane","75-27-4",{"$f":"IFERROR(VLOOKUP(C64,RBCs!$B$5:$C$265,2,FALSE),\"NoRBC\")","v":"NoRBC"}]
[null,"Bromoform","75-25-2"]
[null,"Bromomethane (Methyl bromide)","74-83-9"]
[null,"1-Bromopropane (n-propyl bromide)","106-94-5"]
[null,"Tris(2,3-dibromopropyl)phosphate","126-72-7",{"$f":"IFERROR(VLOOKUP(C68,RBCs!$B$5:$C$265,2,FALSE),\"NoRBC\")","v":"NoRBC"}]
[null,"1,3-Butadiene","106-99-0"]
[null,"2-Butanone (Methyl ethyl ketone)","78-93-3"]
[null,"t-Butyl acetate","540-88-5",{"$f":"IFERROR(VLOOKUP(C71,RBCs!$B$5:$C$265,2,FALSE),\"NoRBC\")","v":"NoRBC"}]
[null,"Butyl acrylate","141-32-2",{"$f":"IFERROR(VLOOKUP(C72,RBCs!$B$5:$C$265,2,FALSE),\"NoRBC\")","v":"NoRBC"}]
[null,"n-Butyl alcohol","71-36-3",{"$f":"IFERROR(VLOOKUP(C73,RBCs!$B$5:$C$265,2,FALSE),\"NoRBC\")","v":"NoRBC"}]
[null,"sec-Butyl alcohol","78-92-2"]
[null,"tert-Butyl alcohol","75-65-0",{"$f":"IFERROR(VLOOKUP(C75,RBCs!$B$5:$C$265,2,FALSE),\"NoRBC\")","v":"NoRBC"}]
[null,"Butyl benzyl phthalate","85-68-7",{"$f":"IFERROR(VLOOKUP(C76,RBCs!$B$5:$C$265,2,FALSE),\"NoRBC\")","v":"NoRBC"}]
[null,"Butylated hydroxyanisole","25013-16-5",{"$f":"IFERROR(VLOOKUP(C77,RBCs!$B$5:$C$265,2,FALSE),\"NoRBC\")","v":"NoRBC"}]
[null,"beta-Butyrolactone","3068-88-0",{"$f":"IFERROR(VLOOKUP(C78,RBCs!$B$5:$C$265,2,FALSE),\"NoRBC\")","v":"NoRBC"}]
[null,"Cadmium and compounds","7440-43-9"]
[null,"Calcium cyanamide","156-62-7",{"$f":"IFERROR(VLOOKUP(C80,RBCs!$B$5:$C$265,2,FALSE),\"NoRBC\")","v":"NoRBC"}]
[null,"Caprolactam","105-60-2"]
[null,"Captafol","2425-06-1",{"$f":"IFERROR(VLOOKUP(C82,RBCs!$B$5:$C$265,2,FALSE),\"NoRBC\")","v":"NoRBC"}]
[null,"Captan","133-06-2",{"$f":"IFERROR(VLOOKUP(C83,RBCs!$B$5:$C$265,2,FALSE),\"NoRBC\")","v":"NoRBC"}]
[null,"Carbon black extracts","89",{"$f":"IFERROR(VLOOKUP(C84,RBCs!$B$5:$C$265,2,FALSE),\"NoRBC\")","v":"NoRBC"}]
[null,"Carbon disulfide","75-15-0"]
[null,"Carbon tetrachloride","56-23-5"]
[null,"Carbonyl sulfide","463-58-1"]
[null,"Carrageenan (degraded)","9000-07-1",{"$f":"IFERROR(VLOOKUP(C88,RBCs!$B$5:$C$265,2,FALSE),\"NoRBC\")","v":"NoRBC"}]
[null,"Catechol","120-80-9",{"$f":"IFERROR(VLOOKUP(C89,RBCs!$B$5:$C$265,2,FALSE),\"NoRBC\")","v":"NoRBC"}]
[null,"Ceramic fibers","351",{"$f":"IFERROR(VLOOKUP(C90,RBCs!$B$5:$C$265,2,FALSE),\"NoRBC\")","v":"NoRBC"}]
[null,"Chloramben","133-90-4",{"$f":"IFERROR(VLOOKUP(C91,RBCs!$B$5:$C$265,2,FALSE),\"NoRBC\")","v":"NoRBC"}]
[null,"Chlorambucil","305-03-3",{"$f":"IFERROR(VLOOKUP(C92,RBCs!$B$5:$C$265,2,FALSE),\"NoRBC\")","v":"NoRBC"}]
[null,"Chlordane","57-74-9"]
[null,"Chlordecone","143-50-0",{"$f":"IFERROR(VLOOKUP(C94,RBCs!$B$5:$C$265,2,FALSE),\"NoRBC\")","v":"NoRBC"}]
[null,"Chlorendic Acid","115-28-6",{"$f":"IFERROR(VLOOKUP(C95,RBCs!$B$5:$C$265,2,FALSE),\"NoRBC\")","v":"NoRBC"}]
[null,"Chlorinated fluorocarbon (1,1,2-Trichloro-1,2,2-trifluoroethane, CFC-113)","76-13-1",{"$f":"IFERROR(VLOOKUP(C96,RBCs!$B$5:$C$265,2,FALSE),\"NoRBC\")","v":"NoRBC"}]
[null,"Chlorinated paraffins","108171-26-2"]
[null,"Chlorine","7782-50-5"]
[null,"Chlorine dioxide","10049-04-4"]
[null,"Chloroacetic acid","79-11-8",{"$f":"IFERROR(VLOOKUP(C100,RBCs!$B$5:$C$265,2,FALSE),\"NoRBC\")","v":"NoRBC"}]
[null,"2-Chloroacetophenone","532-27-4"]
[null,"Chloroalkanes C10-13 (Chlorinated paraffins)","85535-84-8",{"$f":"IFERROR(VLOOKUP(C102,RBCs!$B$5:$C$265,2,FALSE),\"NoRBC\")","v":"NoRBC"}]
[null,"p-Chloroaniline","106-47-8",{"$f":"IFERROR(VLOOKUP(C103,RBCs!$B$5:$C$265,2,FALSE),\"NoRBC\")","v":"NoRBC"}]
[null,"Chlorobenzene","108-90-7"]
[null,"Chlorobenzilate (Ethyl-4,4'-dichlorobenzilate)","510-15-6",{"$f":"IFERROR(VLOOKUP(C105,RBCs!$B$5:$C$265,2,FALSE),\"NoRBC\")","v":"NoRBC"}]
[null,"1-Chloro-1,1-difluoroethane","75-68-3"]
[null,"Chlorodifluoromethane (Freon 22)","75-45-6"]
[null,"Chloroethane (Ethyl chloride)","75-00-3"]
[null,"Chloroform","67-66-3"]
[null,"Chloromethane (Methyl chloride)","74-87-3"]
[null,"Chloromethyl methyl ether (technical grade)","107-30-2",{"$f":"IFERROR(VLOOKUP(C111,RBCs!$B$5:$C$265,2,FALSE),\"NoRBC\")","v":"NoRBC"}]
[null,"3-Chloro-2-methyl-1-propene","563-47-3",{"$f":"IFERROR(VLOOKUP(C112,RBCs!$B$5:$C$265,2,FALSE),\"NoRBC\")","v":"NoRBC"}]
[null,"2-Chlorophenol","95-57-8",{"$f":"IFERROR(VLOOKUP(C113,RBCs!$B$5:$C$265,2,FALSE),\"NoRBC\")","v":"NoRBC"}]
[null,"4-Chloro-o-phenylenediamine","95-83-0"]
[null,"Chloropicrin","76-06-2"]
[null,"Chloroprene","126-99-8"]
[null,"Chlorothalonil","1897-45-6",{"$f":"IFERROR(VLOOKUP(C117,RBCs!$B$5:$C$265,2,FALSE),\"NoRBC\")","v":"NoRBC"}]
[null,"p-Chloro-o-toluidine","95-69-2"]
[null,"Chlorozotocin","54749-90-5",{"$f":"IFERROR(VLOOKUP(C119,RBCs!$B$5:$C$265,2,FALSE),\"NoRBC\")","v":"NoRBC"}]
[null,"Chromic(VI) Acid","7738-94-5"]
[null,"Chromium VI, chromate and dichromate particulate","18540-29-9"]
[null,"Chromium trioxide","1333-82-0",{"$f":"IFERROR(VLOOKUP(C122,RBCs!$B$5:$C$265,2,FALSE),\"NoRBC\")","v":"NoRBC"}]
[null,"C.I. Basic Red 9 Monohydrochloride","569-61-9",{"$f":"IFERROR(VLOOKUP(C123,RBCs!$B$5:$C$265,2,FALSE),\"NoRBC\")","v":"NoRBC"}]
[null,"Cinnamyl anthranilate","87-29-6",{"$f":"IFERROR(VLOOKUP(C124,RBCs!$B$5:$C$265,2,FALSE),\"NoRBC\")","v":"NoRBC"}]
[null,"Cobalt and compounds","7440-48-4"]
[null,"Coke Oven Emissions","148"]
[null,"Copper and compounds","7440-50-8"]
[null,"Creosotes","150",{"$f":"IFERROR(VLOOKUP(C128,RBCs!$B$5:$C$265,2,FALSE),\"NoRBC\")","v":"NoRBC"}]
[null,"p-Cresidine","120-71-8"]
[null,"Cresols (mixture), including m-cresol, o-cresol, p-cresol","1319-77-3"]
[null,"m-Cresol","108-39-4",{"$f":"IFERROR(VLOOKUP(C131,RBCs!$B$5:$C$265,2,FALSE),\"NoRBC\")","v":"NoRBC"}]
[null,"o-Cresol","95-48-7",{"$f":"IFERROR(VLOOKUP(C132,RBCs!$B$5:$C$265,2,FALSE),\"NoRBC\")","v":"NoRBC"}]
[null,"p-Cresol","106-44-5",{"$f":"IFERROR(VLOOKUP(C133,RBCs!$B$5:$C$265,2,FALSE),\"NoRBC\")","v":"NoRBC"}]
[null,"Crotonaldehyde","4170-30-3",{"$f":"IFERROR(VLOOKUP(C134,RBCs!$B$5:$C$265,2,FALSE),\"NoRBC\")","v":"NoRBC"}]
[null,"Cumene hydroperoxide","80-15-9",{"$f":"IFERROR(VLOOKUP(C135,RBCs!$B$5:$C$265,2,FALSE),\"NoRBC\")","v":"NoRBC"}]
[null,"Cupferron","135-20-6"]
[null,"Cyanide compounds","57-12-5",{"$f":"IFERROR(VLOOKUP(C137,RBCs!$B$5:$C$265,2,FALSE),\"NoRBC\")","v":"NoRBC"}]
[null,"Cyanide, hydrogen","74-90-8"]
[null,"Cyclohexane","110-82-7"]
[null,"Cyclohexanol","108-93-0",{"$f":"IFERROR(VLOOKUP(C140,RBCs!$B$5:$C$265,2,FALSE),\"NoRBC\")","v":"NoRBC"}]
[null,"Cycloheximide","66-81-9",{"$f":"IFERROR(VLOOKUP(C141,RBCs!$B$5:$C$265,2,FALSE),\"NoRBC\")","v":"NoRBC"}]
[null,"Cyclophosphamide (anhydrous)","50-18-0",{"$f":"IFERROR(VLOOKUP(C142,RBCs!$B$5:$C$265,2,FALSE),\"NoRBC\")","v":"NoRBC"}]
[null,"Cyclophosphamide (hydrated)","6055-19-2",{"$f":"IFERROR(VLOOKUP(C143,RBCs!$B$5:$C$265,2,FALSE),\"NoRBC\")","v":"NoRBC"}]
[null,"D & C Red No. 9","5160-02-1",{"$f":"IFERROR(VLOOKUP(C144,RBCs!$B$5:$C$265,2,FALSE),\"NoRBC\")","v":"NoRBC"}]
[null,"Dacarbazine","4342-03-4",{"$f":"IFERROR(VLOOKUP(C145,RBCs!$B$5:$C$265,2,FALSE),\"NoRBC\")","v":"NoRBC"}]
[null,"Dantron","117-10-2",{"$f":"IFERROR(VLOOKUP(C146,RBCs!$B$5:$C$265,2,FALSE),\"NoRBC\")","v":"NoRBC"}]
[null,"4,4'-DDD (4,4'-dichlorodiphenyldichloroethane)","72-54-8",{"$f":"IFERROR(VLOOKUP(C147,RBCs!$B$5:$C$265,2,FALSE),\"NoRBC\")","v":"NoRBC"}]
[null,"2,4'-DDD (2,4'-dichlorodiphenyldichloroethane)","53-19-0",{"$f":"IFERROR(VLOOKUP(C148,RBCs!$B$5:$C$265,2,FALSE),\"NoRBC\")","v":"NoRBC"}]
[null,"DDE (1-chloro-4-[1-(4-chlorophenyl)ethyl]benzene)","3547-04-4",{"$f":"IFERROR(VLOOKUP(C149,RBCs!$B$5:$C$265,2,FALSE),\"NoRBC\")","v":"NoRBC"}]
[null,"2,4'-DDE (2,4'-dichlorodiphenyldichloroethene)","3424-82-6",{"$f":"IFERROR(VLOOKUP(C150,RBCs!$B$5:$C$265,2,FALSE),\"NoRBC\")","v":"NoRBC"}]
[null,"4,4'-DDE (4,4'-dichlorodiphenyldichloroethene)","72-55-9",{"$f":"IFERROR(VLOOKUP(C151,RBCs!$B$5:$C$265,2,FALSE),\"NoRBC\")","v":"NoRBC"}]
[null,"2,4'-DDT (2,4'-dichlorodiphenyltrichloroethane)","789-02-6",{"$f":"IFERROR(VLOOKUP(C152,RBCs!$B$5:$C$265,2,FALSE),\"NoRBC\")","v":"NoRBC"}]
[null,"DDT","50-29-3"]
[null,"2,4-Diaminoanisole","615-05-4"]
[null,"2,4-Diaminoanisole sulfate","39156-41-7",{"$f":"IFERROR(VLOOKUP(C155,RBCs!$B$5:$C$265,2,FALSE),\"NoRBC\")","v":"NoRBC"}]
[null,"4,4'-Diaminodiphenyl ether","101-80-4",{"$f":"IFERROR(VLOOKUP(C156,RBCs!$B$5:$C$265,2,FALSE),\"NoRBC\")","v":"NoRBC"}]
[null,"2,4-Diaminotoluene (2,4-Toluene diamine)","95-80-7"]
[null,"Diazomethane","334-88-3",{"$f":"IFERROR(VLOOKUP(C158,RBCs!$B$5:$C$265,2,FALSE),\"NoRBC\")","v":"NoRBC"}]
[null,"Diazinon","333-41-5"]
[null,"Dibenzofuran","132-64-9",{"$f":"IFERROR(VLOOKUP(C160,RBCs!$B$5:$C$265,2,FALSE),\"NoRBC\")","v":"NoRBC"}]
[null,"Dibromochloromethane","124-48-1",{"$f":"IFERROR(VLOOKUP(C161,RBCs!$B$5:$C$265,2,FALSE),\"NoRBC\")","v":"NoRBC"}]
[null,"1,2-Dibromo-3-chloropropane (DBCP)","96-12-8"]
[null,"2,3-Dibromo-1-propanol","96-13-9",{"$f":"IFERROR(VLOOKUP(C163,RBCs!$B$5:$C$265,2,FALSE),\"NoRBC\")","v":"NoRBC"}]
[null,"Dibutyl phthalate","84-74-2",{"$f":"IFERROR(VLOOKUP(C164,RBCs!$B$5:$C$265,2,FALSE),\"NoRBC\")","v":"NoRBC"}]
[null,"1,2-Dichlorobenzene","95-50-1",{"$f":"IFERROR(VLOOKUP(C165,RBCs!$B$5:$C$265,2,FALSE),\"NoRBC\")","v":"NoRBC"}]
[null,"1,3-Dichlorobenzene","541-73-1",{"$f":"IFERROR(VLOOKUP(C166,RBCs!$B$5:$C$265,2,FALSE),\"NoRBC\")","v":"NoRBC"}]
[null,"p-Dichlorobenzene (1,4-Dichlorobenzene)","106-46-7"]
[null,"3,3'-Dichlorobenzidine","91-94-1"]
[null,"Dichlorodifluoromethane (Freon 12)","75-71-8",{"$f":"IFERROR(VLOOKUP(C169,RBCs!$B$5:$C$265,2,FALSE),\"NoRBC\")","v":"NoRBC"}]
[null,"Dichlorofluoromethane (Freon 21)","75-43-4",{"$f":"IFERROR(VLOOKUP(C170,RBCs!$B$5:$C$265,2,FALSE),\"NoRBC\")","v":"NoRBC"}]
[null,"1,1-Dichloroethane (Ethylidene dichloride)","75-34-3"]
[null,"trans-1,2-dichloroethene","156-60-5"]
[null,"Dichloromethane (Methylene chloride)","75-09-2"]
[null,"2,4-Dichlorophenol","120-83-2",{"$f":"IFERROR(VLOOKUP(C174,RBCs!$B$5:$C$265,2,FALSE),\"NoRBC\")","v":"NoRBC"}]
[null,"Dichlorophenoxyacetic acid, salts and esters (2,4-D)","94-75-7",{"$f":"IFERROR(VLOOKUP(C175,RBCs!$B$5:$C$265,2,FALSE),\"NoRBC\")","v":"NoRBC"}]
[null,"1,2-Dichloropropane (Propylene dichloride)","78-87-5"]
[null,"1,3-Dichloropropene","542-75-6"]
[null,"Dichlorovos (DDVP)","62-73-7"]
[null,"Dicofol","115-32-2",{"$f":"IFERROR(VLOOKUP(C179,RBCs!$B$5:$C$265,2,FALSE),\"NoRBC\")","v":"NoRBC"}]
[null,"Di-cyclohexyl phthalate (DCHP)","84-61-7",{"$f":"IFERROR(VLOOKUP(C180,RBCs!$B$5:$C$265,2,FALSE),\"NoRBC\")","v":"NoRBC"}]
[null,"Dieldrin","60-57-1"]
[null,"Diesel Particulate Matter","200"]
[null,"Diethanolamine","111-42-2"]
[null,"Diethylene glycol","111-46-6",{"$f":"IFERROR(VLOOKUP(C184,RBCs!$B$5:$C$265,2,FALSE),\"NoRBC\")","v":"NoRBC"}]
[null,"Diethylene glycol dimethyl ether","111-96-6",{"$f":"IFERROR(VLOOKUP(C185,RBCs!$B$5:$C$265,2,FALSE),\"NoRBC\")","v":"NoRBC"}]
[null,"Diethylene glycol monobutyl ether","112-34-5"]
[null,"Diethylene glycol monoethyl ether","111-90-0"]
[null,"Diethylene glycol monomethyl ether","111-77-3",{"$f":"IFERROR(VLOOKUP(C188,RBCs!$B$5:$C$265,2,FALSE),\"NoRBC\")","v":"NoRBC"}]
[null,"Diethylphthalate","84-66-2",{"$f":"IFERROR(VLOOKUP(C189,RBCs!$B$5:$C$265,2,FALSE),\"NoRBC\")","v":"NoRBC"}]
[null,"Diethyl sulfate","64-67-5",{"$f":"IFERROR(VLOOKUP(C190,RBCs!$B$5:$C$265,2,FALSE),\"NoRBC\")","v":"NoRBC"}]
[null,"Diethyltoluamide, N,N- (DEET)","134-62-3",{"$f":"IFERROR(VLOOKUP(C191,RBCs!$B$5:$C$265,2,FALSE),\"NoRBC\")","v":"NoRBC"}]
[null,"1,1-Difluoroethane","75-37-6"]
[null,"Diglycidyl resorcinol ether","101-90-6",{"$f":"IFERROR(VLOOKUP(C193,RBCs!$B$5:$C$265,2,FALSE),\"NoRBC\")","v":"NoRBC"}]
[null,"Dihydrosafrole","94-58-6",{"$f":"IFERROR(VLOOKUP(C194,RBCs!$B$5:$C$265,2,FALSE),\"NoRBC\")","v":"NoRBC"}]
[null,"3,3'-Dimethoxybenzidine","119-90-4",{"$f":"IFERROR(VLOOKUP(C195,RBCs!$B$5:$C$265,2,FALSE),\"NoRBC\")","v":"NoRBC"}]
[null,"4-Dimethylaminoazobenzene","60-11-7"]
[null,"N,N-Dimethylaniline","121-69-7",{"$f":"IFERROR(VLOOKUP(C197,RBCs!$B$5:$C$265,2,FALSE),\"NoRBC\")","v":"NoRBC"}]
[null,"3,3'-Dimethylbenzidine (o-Tolidine)","119-93-7",{"$f":"IFERROR(VLOOKUP(C198,RBCs!$B$5:$C$265,2,FALSE),\"NoRBC\")","v":"NoRBC"}]
[null,"Dimethyl carbamoyl chloride","79-44-7",{"$f":"IFERROR(VLOOKUP(C199,RBCs!$B$5:$C$265,2,FALSE),\"NoRBC\")","v":"NoRBC"}]
[null,"Dimethyl formamide","68-12-2"]
[null,"1,1-Dimethylhydrazine","57-14-7"]
[null,"Dimethyl phthalate","131-11-3",{"$f":"IFERROR(VLOOKUP(C202,RBCs!$B$5:$C$265,2,FALSE),\"NoRBC\")","v":"NoRBC"}]
[null,"Dimethyl sulfate","77-78-1",{"$f":"IFERROR(VLOOKUP(C203,RBCs!$B$5:$C$265,2,FALSE),\"NoRBC\")","v":"NoRBC"}]
[null,"Dimethylvinylchloride","513-37-1",{"$f":"IFERROR(VLOOKUP(C204,RBCs!$B$5:$C$265,2,FALSE),\"NoRBC\")","v":"NoRBC"}]
[null,"4,6-Dinitro-o-cresol (and salts)","534-52-1",{"$f":"IFERROR(VLOOKUP(C205,RBCs!$B$5:$C$265,2,FALSE),\"NoRBC\")","v":"NoRBC"}]
[null,"2,4-Dinitrophenol","51-28-5",{"$f":"IFERROR(VLOOKUP(C206,RBCs!$B$5:$C$265,2,FALSE),\"NoRBC\")","v":"NoRBC"}]
[null,"2,4-Dinitrotoluene","121-14-2"]
[null,"2,6-Dinitrotoluene","606-20-2",{"$f":"IFERROR(VLOOKUP(C208,RBCs!$B$5:$C$265,2,FALSE),\"NoRBC\")","v":"NoRBC"}]
[null,"1,4-Dioxane","123-91-1"]
[null,"Diphenylhydantoin","630-93-3",{"$f":"IFERROR(VLOOKUP(C210,RBCs!$B$5:$C$265,2,FALSE),\"NoRBC\")","v":"NoRBC"}]
[null,"1,2-Diphenylhydrazine (Hydrazobenzene)","122-66-7"]
[null,"Dipropylene glycol","25265-71-8",{"$f":"IFERROR(VLOOKUP(C212,RBCs!$B$5:$C$265,2,FALSE),\"NoRBC\")","v":"NoRBC"}]
[null,"Dipropylene glycol monomethyl ether","34590-94-8",{"$f":"IFERROR(VLOOKUP(C213,RBCs!$B$5:$C$265,2,FALSE),\"NoRBC\")","v":"NoRBC"}]
[null,"Direct Black 38","1937-37-7"]
[null,"Direct Blue 6","2602-46-2"]
[null,"Direct Brown 95 (technical grade)","16071-86-6"]
[null,"Disperse Blue 1","2475-45-8",{"$f":"IFERROR(VLOOKUP(C217,RBCs!$B$5:$C$265,2,FALSE),\"NoRBC\")","v":"NoRBC"}]
[null,"Disulfoton","298-04-4"]
[null,"Epichlorohydrin","106-89-8"]
[null,"1,2-Epoxybutane","106-88-7"]
[null,"Epoxy resins","227",{"$f":"IFERROR(VLOOKUP(C221,RBCs!$B$5:$C$265,2,FALSE),\"NoRBC\")","v":"NoRBC"}]
[null,"Erionite","12510-42-8",{"$f":"IFERROR(VLOOKUP(C222,RBCs!$B$5:$C$265,2,FALSE),\"NoRBC\")","v":"NoRBC"}]
[null,"Ethyl acrylate","140-88-5"]
[null,"Ethyl benzene","100-41-4"]
[null,"Ethylene","74-85-1",{"$f":"IFERROR(VLOOKUP(C225,RBCs!$B$5:$C$265,2,FALSE),\"NoRBC\")","v":"NoRBC"}]
[null,"Ethylene dibromide (EDB, 1,2-Dibromoethane)","106-93-4"]
[null,"Ethylene dichloride (EDC, 1,2-Dichloroethane)","107-06-2"]
[null,"Ethylene glycol","107-21-1"]
[null,"Ethylene glycol diethyl ether","629-14-1",{"$f":"IFERROR(VLOOKUP(C229,RBCs!$B$5:$C$265,2,FALSE),\"NoRBC\")","v":"NoRBC"}]
[null,"Ethylene glycol dimethyl ether","110-71-4",{"$f":"IFERROR(VLOOKUP(C230,RBCs!$B$5:$C$265,2,FALSE),\"NoRBC\")","v":"NoRBC"}]
[null,"Ethylene glycol monobutyl ether","111-76-2"]
[null,"Ethylene glycol monoethyl ether","110-80-5"]
[null,"Ethylene glycol monoethyl ether acetate","111-15-9"]
[null,"Ethylene glycol monomethyl ether","109-86-4"]
[null,"Ethylene glycol monomethyl ether acetate","110-49-6"]
[null,"Ethylene glycol monopropyl ether","2807-30-9",{"$f":"IFERROR(VLOOKUP(C236,RBCs!$B$5:$C$265,2,FALSE),\"NoRBC\")","v":"NoRBC"}]
[null,"Ethyleneimine (Aziridine)","151-56-4",{"$f":"IFERROR(VLOOKUP(C237,RBCs!$B$5:$C$265,2,FALSE),\"NoRBC\")","v":"NoRBC"}]
[null,"Ethylene oxide","75-21-8"]
[null,"Ethylene thiourea","96-45-7"]
[null,"Ferric Sulfate","10028-22-5",{"$f":"IFERROR(VLOOKUP(C240,RBCs!$B$5:$C$265,2,FALSE),\"NoRBC\")","v":"NoRBC"}]
[null,"Fluorides","239"]
[null,"Fluorine gas","7782-41-4"]
[null,"Formaldehyde","50-00-0"]
[null,"Furan","110-00-9",{"$f":"IFERROR(VLOOKUP(C244,RBCs!$B$5:$C$265,2,FALSE),\"NoRBC\")","v":"NoRBC"}]
[null,"Furmecyclox","60568-05-0",{"$f":"IFERROR(VLOOKUP(C245,RBCs!$B$5:$C$265,2,FALSE),\"NoRBC\")","v":"NoRBC"}]
[null,"Furylfuramide","3688-53-7",{"$f":"IFERROR(VLOOKUP(C246,RBCs!$B$5:$C$265,2,FALSE),\"NoRBC\")","v":"NoRBC"}]
[null,"Glasswool fibers","352",{"$f":"IFERROR(VLOOKUP(C247,RBCs!$B$5:$C$265,2,FALSE),\"NoRBC\")","v":"NoRBC"}]
[null,"Glutaraldehyde","111-30-8"]
[null,"Glu-P-1","67730-11-4",{"$f":"IFERROR(VLOOKUP(C249,RBCs!$B$5:$C$265,2,FALSE),\"NoRBC\")","v":"NoRBC"}]
[null,"Glu-P-2","67730-10-3",{"$f":"IFERROR(VLOOKUP(C250,RBCs!$B$5:$C$265,2,FALSE),\"NoRBC\")","v":"NoRBC"}]
[null,"Gyromitrin","16568-02-8",{"$f":"IFERROR(VLOOKUP(C251,RBCs!$B$5:$C$265,2,FALSE),\"NoRBC\")","v":"NoRBC"}]
[null,"HC Blue 1","2784-94-3",{"$f":"IFERROR(VLOOKUP(C252,RBCs!$B$5:$C$265,2,FALSE),\"NoRBC\")","v":"NoRBC"}]
[null,"Heptachlor","76-44-8"]
[null,"Heptachlor epoxide","1024-57-3"]
[null,"Hexachlorobenzene","118-74-1"]
[null,"Hexachlorobutadiene","87-68-3"]
[null,"Hexachlorocyclohexanes (mixture) including but not limited to:","608-73-1"]
[null,"Hexachlorocyclohexane, alpha-","319-84-6"]
[null,"Hexachlorocyclohexane, beta-","319-85-7"]
[null,"Hexachlorocyclohexane, gamma- (Lindane)","58-89-9"]
[null,"Hexachlorocyclopentadiene","77-47-4"]
[null,"Hexachloroethane","67-72-1"]
[null,"Hexamethylphosphoramide","680-31-9",{"$f":"IFERROR(VLOOKUP(C263,RBCs!$B$5:$C$265,2,FALSE),\"NoRBC\")","v":"NoRBC"}]
[null,"Hexamethylene-1,6-diisocyanate","822-06-0"]
[null,"Hexane","110-54-3"]
[null,"Hydrazine","302-01-2"]
[null,"Hydrazine sulfate","10034-93-2",{"$f":"IFERROR(VLOOKUP(C267,RBCs!$B$5:$C$265,2,FALSE),\"NoRBC\")","v":"NoRBC"}]
[null,"Hydrochloric acid","7647-01-0"]
[null,"Hydrogen bromide","10035-10-6",{"$f":"IFERROR(VLOOKUP(C269,RBCs!$B$5:$C$265,2,FALSE),\"NoRBC\")","v":"NoRBC"}]
[null,"Hydrogen fluoride","7664-39-3"]
[null,"Hydrogen sulfide","7783-06-4"]
[null,"Hydroquinone","123-31-9",{"$f":"IFERROR(VLOOKUP(C272,RBCs!$B$5:$C$265,2,FALSE),\"NoRBC\")","v":"NoRBC"}]
[null,"Iodine-131","24267-56-9",{"$f":"IFERROR(VLOOKUP(C273,RBCs!$B$5:$C$265,2,FALSE),\"NoRBC\")","v":"NoRBC"}]
[null,"Iron pentacarbonyl","13463-40-6",{"$f":"IFERROR(VLOOKUP(C274,RBCs!$B$5:$C$265,2,FALSE),\"NoRBC\")","v":"NoRBC"}]
[null,"Isophorone","78-59-1"]
[null,"Isoprene, except from vegetative emission sources","78-79-5",{"$f":"IFERROR(VLOOKUP(C276,RBCs!$B$5:$C$265,2,FALSE),\"NoRBC\")","v":"NoRBC"}]
[null,"Isopropyl alcohol","67-63-0"]
[null,"Isopropylbenzene (Cumene)","98-82-8"]
[null,"4,4'-Isopropylidenediphenol","80-05-7",{"$f":"IFERROR(VLOOKUP(C279,RBCs!$B$5:$C$265,2,FALSE),\"NoRBC\")","v":"NoRBC"}]
[null,"Lasiocarpine","303-34-4",{"$f":"IFERROR(VLOOKUP(C280,RBCs!$B$5:$C$265,2,FALSE),\"NoRBC\")","v":"NoRBC"}]
[null,"Lead and compounds","7439-92-1"]
[null,"Lead chromate oxide","18454-12-1",{"$f":"IFERROR(VLOOKUP(C282,RBCs!$B$5:$C$265,2,FALSE),\"NoRBC\")","v":"NoRBC"}]
[null,"Maleic anhydride","108-31-6"]
[null,"Manganese and compounds","7439-96-5"]
[null,"Melphalan","148-82-3",{"$f":"IFERROR(VLOOKUP(C285,RBCs!$B$5:$C$265,2,FALSE),\"NoRBC\")","v":"NoRBC"}]
[null,"Melphalan HCl","3223-07-2",{"$f":"IFERROR(VLOOKUP(C286,RBCs!$B$5:$C$265,2,FALSE),\"NoRBC\")","v":"NoRBC"}]
[null,"Mercury and compounds","7439-97-6"]
[null,"Diethylmercury","627-44-1",{"$f":"IFERROR(VLOOKUP(C288,RBCs!$B$5:$C$265,2,FALSE),\"NoRBC\")","v":"NoRBC"}]
[null,"Dimethylmercury","593-74-8",{"$f":"IFERROR(VLOOKUP(C289,RBCs!$B$5:$C$265,2,FALSE),\"NoRBC\")","v":"NoRBC"}]
[null,"Methylmercury","22967-92-6",{"$f":"IFERROR(VLOOKUP(C290,RBCs!$B$5:$C$265,2,FALSE),\"NoRBC\")","v":"NoRBC"}]
[null,"Methanol","67-56-1"]
[null,"Methoxychlor","72-43-5",{"$f":"IFERROR(VLOOKUP(C292,RBCs!$B$5:$C$265,2,FALSE),\"NoRBC\")","v":"NoRBC"}]
[null,"Trans-2[(dimethylamino)-methylimino]-5-[2-(5-nitro-2-furyl)-vinyl]-1,3,4-oxadiazole","55738-54-0",{"$f":"IFERROR(VLOOKUP(C293,RBCs!$B$5:$C$265,2,FALSE),\"NoRBC\")","v":"NoRBC"}]
[null,"4,4'-Methylene bis(2-chloroaniline) (MOCA)","101-14-4"]
[null,"4,4'-Methylenedianiline (and its dichloride)","101-77-9"]
[null,"4,4-Methylenedianiline dihydrochloride","13552-44-8",{"$f":"IFERROR(VLOOKUP(C296,RBCs!$B$5:$C$265,2,FALSE),\"NoRBC\")","v":"NoRBC"}]
[null,"4,4-Methylene bis(2-methylaniline)","838-88-0",{"$f":"IFERROR(VLOOKUP(C297,RBCs!$B$5:$C$265,2,FALSE),\"NoRBC\")","v":"NoRBC"}]
[null,"4,4'-Methylene bis(N,N'-dimethyl)aniline","101-61-1",{"$f":"IFERROR(VLOOKUP(C298,RBCs!$B$5:$C$265,2,FALSE),\"NoRBC\")","v":"NoRBC"}]
[null,"Methylene diphenyl diisocyanate (MDI)","101-68-8"]
[null,"Methyl hydrazine","60-34-4",{"$f":"IFERROR(VLOOKUP(C300,RBCs!$B$5:$C$265,2,FALSE),\"NoRBC\")","v":"NoRBC"}]
[null,"1,2-Dimethylhydrazine","540-73-8",{"$f":"IFERROR(VLOOKUP(C301,RBCs!$B$5:$C$265,2,FALSE),\"NoRBC\")","v":"NoRBC"}]
[null,"Methyl iodide (Iodomethane)","74-88-4",{"$f":"IFERROR(VLOOKUP(C302,RBCs!$B$5:$C$265,2,FALSE),\"NoRBC\")","v":"NoRBC"}]
[null,"Methyl isobutyl ketone (MIBK, Hexone)","108-10-1"]
[null,"Methyl isocyanate","624-83-9"]
[null,"2-Methyllactonitrile (Acetone cyanohydrin)","75-86-5",{"$f":"IFERROR(VLOOKUP(C305,RBCs!$B$5:$C$265,2,FALSE),\"NoRBC\")","v":"NoRBC"}]
[null,"Methyl methacrylate","80-62-6"]
[null,"Methyl Methanesulfonate","66-27-3",{"$f":"IFERROR(VLOOKUP(C307,RBCs!$B$5:$C$265,2,FALSE),\"NoRBC\")","v":"NoRBC"}]
[null,"2-Methyl-1-nitroanthraquinone","129-15-7",{"$f":"IFERROR(VLOOKUP(C308,RBCs!$B$5:$C$265,2,FALSE),\"NoRBC\")","v":"NoRBC"}]
[null,"N-Methyl-N-nitro-N-nitrosoguanidine","70-25-7",{"$f":"IFERROR(VLOOKUP(C309,RBCs!$B$5:$C$265,2,FALSE),\"NoRBC\")","v":"NoRBC"}]
[null,"1-Methylphenanthrene","832-69-9",{"$f":"IFERROR(VLOOKUP(C310,RBCs!$B$5:$C$265,2,FALSE),\"NoRBC\")","v":"NoRBC"}]
[null,"1-Methylpyrene","2381-21-7",{"$f":"IFERROR(VLOOKUP(C311,RBCs!$B$5:$C$265,2,FALSE),\"NoRBC\")","v":"NoRBC"}]
[null,"2-Methylpyridine","109-06-8",{"$f":"IFERROR(VLOOKUP(C312,RBCs!$B$5:$C$265,2,FALSE),\"NoRBC\")","v":"NoRBC"}]
[null,"Methyl tert-butyl ether","1634-04-4"]
[null,"Methylthiouracil","56-04-2",{"$f":"IFERROR(VLOOKUP(C314,RBCs!$B$5:$C$265,2,FALSE),\"NoRBC\")","v":"NoRBC"}]
[null,"Michler's ketone","90-94-8"]
[null,"Mineral fiber emissions from facilities manufacturing or processing glass, rock, or slag fibers (or other mineral derived fibers) of average diameter 1 micrometer or less.","349",{"$f":"IFERROR(VLOOKUP(C316,RBCs!$B$5:$C$265,2,FALSE),\"NoRBC\")","v":"NoRBC"}]
[null,"Mineral fibers (fine mineral fibers which are man-made, and are airborne particles of a respirable size greater than 5 microns in length, less than or equal to 3.5 microns in diameter, with a length to diameter ratio of 3:1)","350",{"$f":"IFERROR(VLOOKUP(C317,RBCs!$B$5:$C$265,2,FALSE),\"NoRBC\")","v":"NoRBC"}]
[null,"Mirex","2385-85-5",{"$f":"IFERROR(VLOOKUP(C318,RBCs!$B$5:$C$265,2,FALSE),\"NoRBC\")","v":"NoRBC"}]
[null,"Mitomycin C","50-07-7",{"$f":"IFERROR(VLOOKUP(C319,RBCs!$B$5:$C$265,2,FALSE),\"NoRBC\")","v":"NoRBC"}]
[null,"Molybdenum trioxide","1313-27-5",{"$f":"IFERROR(VLOOKUP(C320,RBCs!$B$5:$C$265,2,FALSE),\"NoRBC\")","v":"NoRBC"}]
[null,"Monocrotaline","315-22-0",{"$f":"IFERROR(VLOOKUP(C321,RBCs!$B$5:$C$265,2,FALSE),\"NoRBC\")","v":"NoRBC"}]
[null,"2-Naphthylamine","91-59-8",{"$f":"IFERROR(VLOOKUP(C322,RBCs!$B$5:$C$265,2,FALSE),\"NoRBC\")","v":"NoRBC"}]
[null,"Naphthalene","91-20-3"]
[null,"Nickel and compounds","7440-02-0",{"$f":"IFERROR(VLOOKUP(C324,RBCs!$B$5:$C$265,2,FALSE),\"NoRBC\")","v":"NoRBC"}]
[null,"Nickel compounds, insoluble","365"]
[null,"Nickel oxide","1313-99-1",{"$f":"IFERROR(VLOOKUP(C326,RBCs!$B$5:$C$265,2,FALSE),\"NoRBC\")","v":"NoRBC"}]
[null,"Nickel subsulfide","12035-72-2",{"$f":"IFERROR(VLOOKUP(C327,RBCs!$B$5:$C$265,2,FALSE),\"NoRBC\")","v":"NoRBC"}]
[null,"Nickel sulfide","11113-75-0",{"$f":"IFERROR(VLOOKUP(C328,RBCs!$B$5:$C$265,2,FALSE),\"NoRBC\")","v":"NoRBC"}]
[null,"Nickel compounds, soluble","368"]
[null,"Nickel acetate","373-02-4",{"$f":"IFERROR(VLOOKUP(C330,RBCs!$B$5:$C$265,2,FALSE),\"NoRBC\")","v":"NoRBC"}]
[null,"Nickel carbonate","3333-67-3",{"$f":"IFERROR(VLOOKUP(C331,RBCs!$B$5:$C$265,2,FALSE),\"NoRBC\")","v":"NoRBC"}]
[null,"Nickel carbonate hydroxide","12607-70-4",{"$f":"IFERROR(VLOOKUP(C332,RBCs!$B$5:$C$265,2,FALSE),\"NoRBC\")","v":"NoRBC"}]
[null,"Nickel carbonyl","13463-39-3",{"$f":"IFERROR(VLOOKUP(C333,RBCs!$B$5:$C$265,2,FALSE),\"NoRBC\")","v":"NoRBC"}]
[null,"Nickel chloride","7718-54-9",{"$f":"IFERROR(VLOOKUP(C334,RBCs!$B$5:$C$265,2,FALSE),\"NoRBC\")","v":"NoRBC"}]
[null,"Nickel hydroxide","12054-48-7",{"$f":"IFERROR(VLOOKUP(C335,RBCs!$B$5:$C$265,2,FALSE),\"NoRBC\")","v":"NoRBC"}]
[null,"Nickel sulfate","7786-81-4",{"$f":"IFERROR(VLOOKUP(C336,RBCs!$B$5:$C$265,2,FALSE),\"NoRBC\")","v":"NoRBC"}]
[null,"Nickel sulfate hexahydrate","10101-97-0",{"$f":"IFERROR(VLOOKUP(C337,RBCs!$B$5:$C$265,2,FALSE),\"NoRBC\")","v":"NoRBC"}]
[null,"Nickel nitrate hexahydrate","13478-00-7",{"$f":"IFERROR(VLOOKUP(C338,RBCs!$B$5:$C$265,2,FALSE),\"NoRBC\")","v":"NoRBC"}]
[null,"Nickelocene","1271-28-9",{"$f":"IFERROR(VLOOKUP(C339,RBCs!$B$5:$C$265,2,FALSE),\"NoRBC\")","v":"NoRBC"}]
[null,"Nifurthiazole","3570-75-0",{"$f":"IFERROR(VLOOKUP(C340,RBCs!$B$5:$C$265,2,FALSE),\"NoRBC\")","v":"NoRBC"}]
[null,"Nitric acid","7697-37-2"]
[null,"Nitrilotriacetic acid","139-13-9",{"$f":"IFERROR(VLOOKUP(C342,RBCs!$B$5:$C$265,2,FALSE),\"NoRBC\")","v":"NoRBC"}]
[null,"Nitrilotriacetic acid, trisodium salt monohydrate","18662-53-8",{"$f":"IFERROR(VLOOKUP(C343,RBCs!$B$5:$C$265,2,FALSE),\"NoRBC\")","v":"NoRBC"}]
[null,"5-Nitro-o-Anisidine","99-59-2",{"$f":"IFERROR(VLOOKUP(C344,RBCs!$B$5:$C$265,2,FALSE),\"NoRBC\")","v":"NoRBC"}]
[null,"Nitrobenzene","98-95-3"]
[null,"4-Nitrobiphenyl","92-93-3",{"$f":"IFERROR(VLOOKUP(C346,RBCs!$B$5:$C$265,2,FALSE),\"NoRBC\")","v":"NoRBC"}]
[null,"Nitrofen","1836-75-5",{"$f":"IFERROR(VLOOKUP(C347,RBCs!$B$5:$C$265,2,FALSE),\"NoRBC\")","v":"NoRBC"}]
[null,"Nitrofurazone","59-87-0",{"$f":"IFERROR(VLOOKUP(C348,RBCs!$B$5:$C$265,2,FALSE),\"NoRBC\")","v":"NoRBC"}]
[null,"1-[(5-Nitrofurfurylidene)-amino]-2-imidazolidinone","555-84-0",{"$f":"IFERROR(VLOOKUP(C349,RBCs!$B$5:$C$265,2,FALSE),\"NoRBC\")","v":"NoRBC"}]
[null,"N-[4-(5-nitro-2-furyl)-2-thiazolyl]-acetamide","531-82-8",{"$f":"IFERROR(VLOOKUP(C350,RBCs!$B$5:$C$265,2,FALSE),\"NoRBC\")","v":"NoRBC"}]
[null,"Nitrogen mustard N-oxide","302-70-5",{"$f":"IFERROR(VLOOKUP(C351,RBCs!$B$5:$C$265,2,FALSE),\"NoRBC\")","v":"NoRBC"}]
[null,"4-Nitrophenol","100-02-7",{"$f":"IFERROR(VLOOKUP(C352,RBCs!$B$5:$C$265,2,FALSE),\"NoRBC\")","v":"NoRBC"}]
[null,"2-Nitropropane","79-46-9"]
[null,"N-Nitrosodi-n-butylamine","924-16-3"]
[null,"N-Nitrosodiethanolamine","1116-54-7",{"$f":"IFERROR(VLOOKUP(C355,RBCs!$B$5:$C$265,2,FALSE),\"NoRBC\")","v":"NoRBC"}]
[null,"N-Nitrosodiethylamine","55-18-5"]
[null,"N-Nitrosodimethylamine","62-75-9"]
[null,"N-Nitrosodiphenylamine","86-30-6"]
[null,"p-Nitrosodiphenylamine","156-10-5"]
[null,"N-Nitrosodi-n-propylamine","621-64-7"]
[null,"N-Nitrosomethylethylamine","10595-95-6"]
[null,"N-Nitroso-N-ethylurea","759-73-9",{"$f":"IFERROR(VLOOKUP(C362,RBCs!$B$5:$C$265,2,FALSE),\"NoRBC\")","v":"NoRBC"}]
[null,"N-Nitroso-N-methylurethane","615-53-2",{"$f":"IFERROR(VLOOKUP(C363,RBCs!$B$5:$C$265,2,FALSE),\"NoRBC\")","v":"NoRBC"}]
[null,"N-Nitroso-N-methylurea","684-93-5",{"$f":"IFERROR(VLOOKUP(C364,RBCs!$B$5:$C$265,2,FALSE),\"NoRBC\")","v":"NoRBC"}]
[null,"N-Nitrosomorpholine","59-89-2"]
[null,"N-Nitrosonornicotine","16543-55-8",{"$f":"IFERROR(VLOOKUP(C366,RBCs!$B$5:$C$265,2,FALSE),\"NoRBC\")","v":"NoRBC"}]
[null,"N-Nitrosopiperidine","100-75-4"]
[null,"N-Nitrosopyrrolidine","930-55-2"]
[null,"trans-Nonachlor","39765-80-5",{"$f":"IFERROR(VLOOKUP(C369,RBCs!$B$5:$C$265,2,FALSE),\"NoRBC\")","v":"NoRBC"}]
[null,"Nonyphenol, 4- (& ethoxylates)","104-40-5",{"$f":"IFERROR(VLOOKUP(C370,RBCs!$B$5:$C$265,2,FALSE),\"NoRBC\")","v":"NoRBC"}]
[null,"Oleum (fuming sulfuric acid)","8014-95-7"]
[null,"Parathion","56-38-2"]
[null,"Pentachlorophenol","87-86-5"]
[null,"Pentabromodiphenyl ether","32534-81-9",{"$f":"IFERROR(VLOOKUP(C374,RBCs!$B$5:$C$265,2,FALSE),\"NoRBC\")","v":"NoRBC"}]
[null,"Pentachloronitrobenzene (Quintobenzene)","82-68-8",{"$f":"IFERROR(VLOOKUP(C375,RBCs!$B$5:$C$265,2,FALSE),\"NoRBC\")","v":"NoRBC"}]
[null,"Peracetic acid","79-21-0",{"$f":"IFERROR(VLOOKUP(C376,RBCs!$B$5:$C$265,2,FALSE),\"NoRBC\")","v":"NoRBC"}]
[null,"Perfluorinated compounds (PFCs)","489",{"$f":"IFERROR(VLOOKUP(C377,RBCs!$B$5:$C$265,2,FALSE),\"NoRBC\")","v":"NoRBC"}]
[null,"Perfluorooctanoic acid (PFOA)","335-67-1",{"$f":"IFERROR(VLOOKUP(C378,RBCs!$B$5:$C$265,2,FALSE),\"NoRBC\")","v":"NoRBC"}]
[null,"Perfluorooctanesulfonic acid (PFOS)","1763-23-1",{"$f":"IFERROR(VLOOKUP(C379,RBCs!$B$5:$C$265,2,FALSE),\"NoRBC\")","v":"NoRBC"}]
[null,"Phenacetin","62-44-2",{"$f":"IFERROR(VLOOKUP(C380,RBCs!$B$5:$C$265,2,FALSE),\"NoRBC\")","v":"NoRBC"}]
[null,"Phenazopyridine","94-78-0",{"$f":"IFERROR(VLOOKUP(C381,RBCs!$B$5:$C$265,2,FALSE),\"NoRBC\")","v":"NoRBC"}]
[null,"Phenazopyridine hydrochloride","136-40-3",{"$f":"IFERROR(VLOOKUP(C382,RBCs!$B$5:$C$265,2,FALSE),\"NoRBC\")","v":"NoRBC"}]
[null,"Phenesterin","3546-10-9",{"$f":"IFERROR(VLOOKUP(C383,RBCs!$B$5:$C$265,2,FALSE),\"NoRBC\")","v":"NoRBC"}]
[null,"Phenobarbital","50-06-6",{"$f":"IFERROR(VLOOKUP(C384,RBCs!$B$5:$C$265,2,FALSE),\"NoRBC\")","v":"NoRBC"}]
[null,"Phenol","108-95-2"]
[null,"Phenoxybenzamine","59-96-1",{"$f":"IFERROR(VLOOKUP(C386,RBCs!$B$5:$C$265,2,FALSE),\"NoRBC\")","v":"NoRBC"}]
[null,"Phenoxybenzamine hydrochloride","63-92-3",{"$f":"IFERROR(VLOOKUP(C387,RBCs!$B$5:$C$265,2,FALSE),\"NoRBC\")","v":"NoRBC"}]
[null,"p-Phenylenediamine","106-50-3",{"$f":"IFERROR(VLOOKUP(C388,RBCs!$B$5:$C$265,2,FALSE),\"NoRBC\")","v":"NoRBC"}]
[null,"o-Phenylphenate, sodium","132-27-4",{"$f":"IFERROR(VLOOKUP(C389,RBCs!$B$5:$C$265,2,FALSE),\"NoRBC\")","v":"NoRBC"}]
[null,"2-Phenylphenol","90-43-7",{"$f":"IFERROR(VLOOKUP(C390,RBCs!$B$5:$C$265,2,FALSE),\"NoRBC\")","v":"NoRBC"}]
[null,"Phosgene","75-44-5"]
[null,"Phosphine","7803-51-2"]
[null,"Phosphoric acid","7664-38-2"]
[null,"Phosphorus and compounds","7723-14-0",{"$f":"IFERROR(VLOOKUP(C394,RBCs!$B$5:$C$265,2,FALSE),\"NoRBC\")","v":"NoRBC"}]
[null,"Phosphorus oxychloride","10025-87-3",{"$f":"IFERROR(VLOOKUP(C395,RBCs!$B$5:$C$265,2,FALSE),\"NoRBC\")","v":"NoRBC"}]
[null,"Phosphorus pentachloride","10026-13-8",{"$f":"IFERROR(VLOOKUP(C396,RBCs!$B$5:$C$265,2,FALSE),\"NoRBC\")","v":"NoRBC"}]
[null,"Phosphorus pentoxide","1314-56-3",{"$f":"IFERROR(VLOOKUP(C397,RBCs!$B$5:$C$265,2,FALSE),\"NoRBC\")","v":"NoRBC"}]
[null,"Phosphorus trichloride","7719-12-2",{"$f":"IFERROR(VLOOKUP(C398,RBCs!$B$5:$C$265,2,FALSE),\"NoRBC\")","v":"NoRBC"}]
[null,"Phosphorus, white","12185-10-3"]
[null,"Phthalates","518",{"$f":"IFERROR(VLOOKUP(C400,RBCs!$B$5:$C$265,2,FALSE),\"NoRBC\")","v":"NoRBC"}]
[null,"Phthalic anhydride","85-44-9"]
[null,"Polybrominated diphenyl ethers (PBDEs)","447"]
[null,"PBDE-47 [2,2',4,4'-Tetrabromodiphenyl ether]","5436-43-1",{"$f":"IFERROR(VLOOKUP(C403,RBCs!$B$5:$C$265,2,FALSE),\"NoRBC\")","v":"NoRBC"}]
[null,"PBDE-99 [2,2’,4,4’,5-Pentabromodiphenyl ether]","60348-60-9",{"$f":"IFERROR(VLOOKUP(C404,RBCs!$B$5:$C$265,2,FALSE),\"NoRBC\")","v":"NoRBC"}]
[null,"PBDE-100 [2,2’,4,4’,6-Pentabromodiphenyl ether]","189084-64-8",{"$f":"IFERROR(VLOOKUP(C405,RBCs!$B$5:$C$265,2,FALSE),\"NoRBC\")","v":"NoRBC"}]
[null,"PBDE-138 [2,2’,3,4,4’,5’-Hexabromodiphenyl ether]","17026-54-3",{"$f":"IFERROR(VLOOKUP(C406,RBCs!$B$5:$C$265,2,FALSE),\"NoRBC\")","v":"NoRBC"}]
[null,"PBDE-153 [2,2',4,4',5,5'-hexabromodiphenyl ether]","68631-49-2",{"$f":"IFERROR(VLOOKUP(C407,RBCs!$B$5:$C$265,2,FALSE),\"NoRBC\")","v":"NoRBC"}]
[null,"PBDE-154 [2,2’,4,4’,5,6’-Hexabromodiphenyl ether]","17026-58-4",{"$f":"IFERROR(VLOOKUP(C408,RBCs!$B$5:$C$265,2,FALSE),\"NoRBC\")","v":"NoRBC"}]
[null,"PBDE-185 [2,2',3,4,4',5',6-Heptabromodiphenyl ether]","68928-80-3",{"$f":"IFERROR(VLOOKUP(C409,RBCs!$B$5:$C$265,2,FALSE),\"NoRBC\")","v":"NoRBC"}]
[null,"PBDE-209 [Decabromodiphenyl ether]","1163-19-5",{"$f":"IFERROR(VLOOKUP(C410,RBCs!$B$5:$C$265,2,FALSE),\"NoRBC\")","v":"NoRBC"}]
[null,"Polychlorinated biphenyls (PCBs)","1336-36-3"]
[null,"Polychlorinated biphenyls (PCBs) TEQ","645"]
[null,"PCB-8 [2,4'-dichlorobiphenyl]","34883-43-7",{"$f":"IFERROR(VLOOKUP(C413,RBCs!$B$5:$C$265,2,FALSE),\"NoRBC\")","v":"NoRBC"}]
[null,"PCB 18 [2,2',5-trichlorobiphenyl]","37680-65-2",{"$f":"IFERROR(VLOOKUP(C414,RBCs!$B$5:$C$265,2,FALSE),\"NoRBC\")","v":"NoRBC"}]
[null,"PCB-28 [2,4,4'-trichlorobiphenyl]","7012-37-5",{"$f":"IFERROR(VLOOKUP(C415,RBCs!$B$5:$C$265,2,FALSE),\"NoRBC\")","v":"NoRBC"}]
[null,"PCB-44 [2,2',3,5'-tetrachlorobiphenyl]","41464-39-5",{"$f":"IFERROR(VLOOKUP(C416,RBCs!$B$5:$C$265,2,FALSE),\"NoRBC\")","v":"NoRBC"}]
[null,"PCB-52 [2,2',5,5'-tetrachlorobiphenyl]","35693-99-3",{"$f":"IFERROR(VLOOKUP(C417,RBCs!$B$5:$C$265,2,FALSE),\"NoRBC\")","v":"NoRBC"}]
[null,"PCB-66 [2,3',4,4'-tetrachlorobiphenyl]","32598-10-0",{"$f":"IFERROR(VLOOKUP(C418,RBCs!$B$5:$C$265,2,FALSE),\"NoRBC\")","v":"NoRBC"}]
[null,"PCB 77 [3,3',4,4'-tetrachlorobiphenyl]","32598-13-3"]
[null,"PCB 81 [3,4,4',5-tetrachlorobiphenyl]","70362-50-4"]
[null,"PCB-101 [2,2',4,5,5'-pentachlorobiphenyl]","37680-73-2",{"$f":"IFERROR(VLOOKUP(C421,RBCs!$B$5:$C$265,2,FALSE),\"NoRBC\")","v":"NoRBC"}]
[null,"PCB 105 [2,3,3',4,4'-pentachlorobiphenyl]","32598-14-4"]
[null,"PCB 114 [2,3,4,4',5-pentachlorobiphenyl]","74472-37-0"]
[null,"PCB 118 [2,3',4,4',5-pentachlorobiphenyl]","31508-00-6"]
[null,"PCB 123 [2,3',4,4',5'-pentachlorobiphenyl]","65510-44-3"]
[null,"PCB 126 [3,3',4,4',5-pentachlorobiphenyl]","57465-28-8"]
[null,"PCB-128 [2,2',3,3',4,4'-hexachlorobiphenyl]","38380-07-3",{"$f":"IFERROR(VLOOKUP(C427,RBCs!$B$5:$C$265,2,FALSE),\"NoRBC\")","v":"NoRBC"}]
[null,"PCB-138 [2,2',3,4,4',5'-hexachlorobiphenyl]","35065-28-2",{"$f":"IFERROR(VLOOKUP(C428,RBCs!$B$5:$C$265,2,FALSE),\"NoRBC\")","v":"NoRBC"}]
[null,"PCB-153 [2,2',4,4',5,5'-hexachlorobiphenyl]","35065-27-1",{"$f":"IFERROR(VLOOKUP(C429,RBCs!$B$5:$C$265,2,FALSE),\"NoRBC\")","v":"NoRBC"}]
[null,"PCB 156 [2,3,3',4,4',5-hexachlorobiphenyl]","38380-08-4"]
[null,"PCB 157 [2,3,3',4,4',5'-hexachlorobiphenyl]","69782-90-7"]
[null,"PCB 167 [2,3',4,4',5,5'-hexachlorobiphenyl]","52663-72-6"]
[null,"PCB 169 [3,3',4,4',5,5'-hexachlorobiphenyl]","32774-16-6"]
[null,"PCB-170 [2,2',3,3',4,4',5-heptachlorobiphenyl]","35065-30-6",{"$f":"IFERROR(VLOOKUP(C434,RBCs!$B$5:$C$265,2,FALSE),\"NoRBC\")","v":"NoRBC"}]
[null,"PCB-180 [2,2',3,4,4',5,5'-heptachlorobiphenyl]","35065-29-3",{"$f":"IFERROR(VLOOKUP(C435,RBCs!$B$5:$C$265,2,FALSE),\"NoRBC\")","v":"NoRBC"}]
[null,"PCB-187 [2,2',3,4',5,5',6-heptachlorobiphenyl]","52663-68-0",{"$f":"IFERROR(VLOOKUP(C436,RBCs!$B$5:$C$265,2,FALSE),\"NoRBC\")","v":"NoRBC"}]
[null,"PCB 189 [2,3,3',4,4',5,5'-heptachlorobiphenyl]","39635-31-9"]
[null,"PCB-195 [2,2',3,3',4,4',5,6-octachlorobiphenyl]","52663-78-2",{"$f":"IFERROR(VLOOKUP(C438,RBCs!$B$5:$C$265,2,FALSE),\"NoRBC\")","v":"NoRBC"}]
[null,"PCB-206 [2,2',3,3',4,4',5,5',6-nonachlorobiphenyl]","40186-72-9",{"$f":"IFERROR(VLOOKUP(C439,RBCs!$B$5:$C$265,2,FALSE),\"NoRBC\")","v":"NoRBC"}]
[null,"PCB-209 [2,2'3,3',4,4',5,5',6,6 '-decachlorobiphenyl]","2051-24-3",{"$f":"IFERROR(VLOOKUP(C440,RBCs!$B$5:$C$265,2,FALSE),\"NoRBC\")","v":"NoRBC"}]
[null,"Polychlorinated dibenzo-p-dioxins (PCDDs) & dibenzofurans (PCDFs) TEQ","646"]
[null,"2,3,7,8-Tetrachlorodibenzo-p-dioxin (TCDD)","1746-01-6"]
[null,"1,2,3,7,8-Pentachlorodibenzo-p-dioxin (PeCDD)","40321-76-4"]
[null,"1,2,3,4,7,8-Hexachlorodibenzo-p-dioxin (HxCDD)","39227-28-6"]
[null,"1,2,3,6,7,8-Hexachlorodibenzo-p-dioxin (HxCDD)","57653-85-7"]
[null,"1,2,3,7,8,9-Hexachlorodibenzo-p-dioxin (HxCDD)","19408-74-3"]
[null,"1,2,3,4,6,7,8-Heptachlorodibenzo-p-dioxin (HpCDD)","35822-46-9"]
[null,"Octachlorodibenzo-p-dioxin (OCDD)","3268-87-9"]
[null,"2,3,7,8-Tetrachlorodibenzofuran (TcDF)","51207-31-9"]
[null,"1,2,3,7,8-Pentachlorodibenzofuran (PeCDF)","57117-41-6"]
[null,"2,3,4,7,8-Pentachlorodibenzofuran (PeCDF)","57117-31-4"]
[null,"1,2,3,4,7,8-Hexachlorodibenzofuran (HxCDF)","70648-26-9"]
[null,"1,2,3,6,7,8-Hexachlorodibenzofuran (HxCDF)","57117-44-9"]
[null,"1,2,3,7,8,9-Hexachlorodibenzofuran (HxCDF)","72918-21-9"]
[null,"2,3,4,6,7,8-Hexachlorodibenzofuran (HxCDF)","60851-34-5"]
[null,"1,2,3,4,6,7,8-Heptachlorodibenzofuran (HpCDF)","67562-39-4"]
[null,"1,2,3,4,7,8,9-Heptachlorodibenzofuran (HpCDF)","55673-89-7"]
[null,"Octachlorodibenzofuran (OCDF)","39001-02-0"]
[null,"Polycyclic aromatic hydrocarbons (PAHs)","401"]
[null,"Acenaphthene","83-32-9",{"$f":"IFERROR(VLOOKUP(C460,RBCs!$B$5:$C$265,2,FALSE),\"NoRBC\")","v":"NoRBC"}]
[null,"Acenaphthylene","208-96-8",{"$f":"IFERROR(VLOOKUP(C461,RBCs!$B$5:$C$265,2,FALSE),\"NoRBC\")","v":"NoRBC"}]
[null,"Anthracene","120-12-7",{"$f":"IFERROR(VLOOKUP(C462,RBCs!$B$5:$C$265,2,FALSE),\"NoRBC\")","v":"NoRBC"}]
[null,"Anthanthrene","191-26-4"]
[null,"Benz[a]anthracene","56-55-3"]
[null,"Benzo[a]pyrene","50-32-8"]
[null,"Benzo[b]fluoranthene","205-99-2"]
[null,"Benzo[c]fluorene","205-12-9"]
[null,"Benzo[e]pyrene","192-97-2",{"$f":"IFERROR(VLOOKUP(C468,RBCs!$B$5:$C$265,2,FALSE),\"NoRBC\")","v":"NoRBC"}]
[null,"Benzo[g,h,i]perylene","191-24-2"]
[null,"Benzo[j]fluoranthene","205-82-3"]
[null,"Benzo[k]fluoranthene","207-08-9"]
[null,"Carbazole","86-74-8",{"$f":"IFERROR(VLOOKUP(C472,RBCs!$B$5:$C$265,2,FALSE),\"NoRBC\")","v":"NoRBC"}]
[null,"Chrysene","218-01-9"]
[null,"Cyclopenta[c,d]pyrene","27208-37-3"]
[null,"Dibenz[a,h]acridine","226-36-8",{"$f":"IFERROR(VLOOKUP(C475,RBCs!$B$5:$C$265,2,FALSE),\"NoRBC\")","v":"NoRBC"}]
[null,"Dibenz[a,j]acridine","224-42-0",{"$f":"IFERROR(VLOOKUP(C476,RBCs!$B$5:$C$265,2,FALSE),\"NoRBC\")","v":"NoRBC"}]
[null,"7H-Dibenzo[c,g]carbazole","194-59-2",{"$f":"IFERROR(VLOOKUP(C477,RBCs!$B$5:$C$265,2,FALSE),\"NoRBC\")","v":"NoRBC"}]
[null,"Dibenz[a,h]anthracene","53-70-3"]
[null,"Dibenzo[a,e]fluoranthene","5385-75-1",{"$f":"IFERROR(VLOOKUP(C479,RBCs!$B$5:$C$265,2,FALSE),\"NoRBC\")","v":"NoRBC"}]
[null,"Dibenzo[a,e]pyrene","192-65-4"]
[null,"Dibenzo[a,h]pyrene","189-64-0"]
[null,"Dibenzo[a,i]pyrene","189-55-9"]
[null,"Dibenzo[a,l]pyrene","191-30-0"]
[null,"Fluoranthene","206-44-0"]
[null,"Fluorene","86-73-7",{"$f":"IFERROR(VLOOKUP(C485,RBCs!$B$5:$C$265,2,FALSE),\"NoRBC\")","v":"NoRBC"}]
[null,"Indeno[1,2,3-cd]pyrene","193-39-5"]
[null,"2-Methyl naphthalene","91-57-6",{"$f":"IFERROR(VLOOKUP(C487,RBCs!$B$5:$C$265,2,FALSE),\"NoRBC\")","v":"NoRBC"}]
[null,"Perylene","198-55-0",{"$f":"IFERROR(VLOOKUP(C488,RBCs!$B$5:$C$265,2,FALSE),\"NoRBC\")","v":"NoRBC"}]
[null,"Phenanthrene","85-01-8",{"$f":"IFERROR(VLOOKUP(C489,RBCs!$B$5:$C$265,2,FALSE),\"NoRBC\")","v":"NoRBC"}]
[null,"Pyrene","129-00-0",{"$f":"IFERROR(VLOOKUP(C490,RBCs!$B$5:$C$265,2,FALSE),\"NoRBC\")","v":"NoRBC"}]
[null,"Polycyclic aromatic hydrocarbon derivatives [PAH-Derivatives]","432",{"$f":"IFERROR(VLOOKUP(C491,RBCs!$B$5:$C$265,2,FALSE),\"NoRBC\")","v":"NoRBC"}]
[null,"2-Acetylaminofluorene","53-96-3",{"$f":"IFERROR(VLOOKUP(C492,RBCs!$B$5:$C$265,2,FALSE),\"NoRBC\")","v":"NoRBC"}]
[null,"2-Aminoanthraquinone","117-79-3",{"$f":"IFERROR(VLOOKUP(C493,RBCs!$B$5:$C$265,2,FALSE),\"NoRBC\")","v":"NoRBC"}]
[null,"Carbaryl","63-25-2",{"$f":"IFERROR(VLOOKUP(C494,RBCs!$B$5:$C$265,2,FALSE),\"NoRBC\")","v":"NoRBC"}]
[null,"7,12-Dimethylbenz[a]anthracene","57-97-6",{"$f":"IFERROR(VLOOKUP(C495,RBCs!$B$5:$C$265,2,FALSE),\"NoRBC\")","v":"NoRBC"}]
[null,"1,6-Dinitropyrene","42397-64-8",{"$f":"IFERROR(VLOOKUP(C496,RBCs!$B$5:$C$265,2,FALSE),\"NoRBC\")","v":"NoRBC"}]
[null,"1,8-Dinitropyrene","42397-65-9",{"$f":"IFERROR(VLOOKUP(C497,RBCs!$B$5:$C$265,2,FALSE),\"NoRBC\")","v":"NoRBC"}]
[null,"3-Methylcholanthrene","56-49-5",{"$f":"IFERROR(VLOOKUP(C498,RBCs!$B$5:$C$265,2,FALSE),\"NoRBC\")","v":"NoRBC"}]
[null,"5-Methylchrysene","3697-24-3"]
[null,"5-Nitroacenaphthene","602-87-9",{"$f":"IFERROR(VLOOKUP(C500,RBCs!$B$5:$C$265,2,FALSE),\"NoRBC\")","v":"NoRBC"}]
[null,"6-Nitrochrysene","7496-02-8"]
[null,"2-Nitrofluorene","607-57-8",{"$f":"IFERROR(VLOOKUP(C502,RBCs!$B$5:$C$265,2,FALSE),\"NoRBC\")","v":"NoRBC"}]
[null,"1-Nitropyrene","5522-43-0",{"$f":"IFERROR(VLOOKUP(C503,RBCs!$B$5:$C$265,2,FALSE),\"NoRBC\")","v":"NoRBC"}]
[null,"4-Nitropyrene","57835-92-4",{"$f":"IFERROR(VLOOKUP(C504,RBCs!$B$5:$C$265,2,FALSE),\"NoRBC\")","v":"NoRBC"}]
[null,"Ponceau 3R","3564-09-8",{"$f":"IFERROR(VLOOKUP(C505,RBCs!$B$5:$C$265,2,FALSE),\"NoRBC\")","v":"NoRBC"}]
[null,"Ponceau MX","3761-53-3",{"$f":"IFERROR(VLOOKUP(C506,RBCs!$B$5:$C$265,2,FALSE),\"NoRBC\")","v":"NoRBC"}]
[null,"Potassium bromate","7758-01-2"]
[null,"Procarbazine","671-16-9",{"$f":"IFERROR(VLOOKUP(C508,RBCs!$B$5:$C$265,2,FALSE),\"NoRBC\")","v":"NoRBC"}]
[null,"Procarbazine hydrochloride","366-70-1",{"$f":"IFERROR(VLOOKUP(C509,RBCs!$B$5:$C$265,2,FALSE),\"NoRBC\")","v":"NoRBC"}]
[null,"1,3-Propane sultone","1120-71-4"]
[null,"beta-Propiolactone","57-57-8",{"$f":"IFERROR(VLOOKUP(C511,RBCs!$B$5:$C$265,2,FALSE),\"NoRBC\")","v":"NoRBC"}]
[null,"Propionaldehyde","123-38-6"]
[null,"Propoxur (Baygon)","114-26-1",{"$f":"IFERROR(VLOOKUP(C513,RBCs!$B$5:$C$265,2,FALSE),\"NoRBC\")","v":"NoRBC"}]
[null,"Propylene","115-07-1"]
[null,"Propylene glycol dinitrate","6423-43-4"]
[null,"Propylene glycol monomethyl ether","107-98-2"]
[null,"Propylene glycol monomethyl ether acetate","108-65-6",{"$f":"IFERROR(VLOOKUP(C517,RBCs!$B$5:$C$265,2,FALSE),\"NoRBC\")","v":"NoRBC"}]
[null,"Propylene oxide","75-56-9"]
[null,"1,2-Propyleneimine (2-Methylaziridine)","75-55-8",{"$f":"IFERROR(VLOOKUP(C519,RBCs!$B$5:$C$265,2,FALSE),\"NoRBC\")","v":"NoRBC"}]
[null,"Propylthiouracil","51-52-5",{"$f":"IFERROR(VLOOKUP(C520,RBCs!$B$5:$C$265,2,FALSE),\"NoRBC\")","v":"NoRBC"}]
[null,"Pyridine","110-86-1",{"$f":"IFERROR(VLOOKUP(C521,RBCs!$B$5:$C$265,2,FALSE),\"NoRBC\")","v":"NoRBC"}]
[null,"Quinoline","91-22-5",{"$f":"IFERROR(VLOOKUP(C522,RBCs!$B$5:$C$265,2,FALSE),\"NoRBC\")","v":"NoRBC"}]
[null,"Quinone","106-51-4",{"$f":"IFERROR(VLOOKUP(C523,RBCs!$B$5:$C$265,2,FALSE),\"NoRBC\")","v":"NoRBC"}]
[null,"Radionuclides","569",{"$f":"IFERROR(VLOOKUP(C524,RBCs!$B$5:$C$265,2,FALSE),\"NoRBC\")","v":"NoRBC"}]
[null,"Radon and its decay products","571",{"$f":"IFERROR(VLOOKUP(C525,RBCs!$B$5:$C$265,2,FALSE),\"NoRBC\")","v":"NoRBC"}]
[null,"Refractory Ceramic Fibers","572"]
[null,"Reserpine","50-55-5",{"$f":"IFERROR(VLOOKUP(C527,RBCs!$B$5:$C$265,2,FALSE),\"NoRBC\")","v":"NoRBC"}]
[null,"Rockwool","353",{"$f":"IFERROR(VLOOKUP(C528,RBCs!$B$5:$C$265,2,FALSE),\"NoRBC\")","v":"NoRBC"}]
[null,"Safrole","94-59-7",{"$f":"IFERROR(VLOOKUP(C529,RBCs!$B$5:$C$265,2,FALSE),\"NoRBC\")","v":"NoRBC"}]
[null,"Selenide, hydrogen","7783-07-5"]
[null,"Selenium and compounds","7782-49-2"]
[null,"Selenium sulfide","7446-34-6",{"$f":"IFERROR(VLOOKUP(C532,RBCs!$B$5:$C$265,2,FALSE),\"NoRBC\")","v":"NoRBC"}]
[null,"Silica, crystalline (respirable)","7631-86-9"]
[null,"Silver and compounds","7440-22-4",{"$f":"IFERROR(VLOOKUP(C534,RBCs!$B$5:$C$265,2,FALSE),\"NoRBC\")","v":"NoRBC"}]
[null,"Slagwool","354",{"$f":"IFERROR(VLOOKUP(C535,RBCs!$B$5:$C$265,2,FALSE),\"NoRBC\")","v":"NoRBC"}]
[null,"Sodium hydroxide","1310-73-2"]
[null,"Sterigmatocystin","10048-13-2",{"$f":"IFERROR(VLOOKUP(C537,RBCs!$B$5:$C$265,2,FALSE),\"NoRBC\")","v":"NoRBC"}]
[null,"Streptozotocin","18883-66-4",{"$f":"IFERROR(VLOOKUP(C538,RBCs!$B$5:$C$265,2,FALSE),\"NoRBC\")","v":"NoRBC"}]
[null,"Styrene","100-42-5"]
[null,"Styrene oxide","96-09-3",{"$f":"IFERROR(VLOOKUP(C540,RBCs!$B$5:$C$265,2,FALSE),\"NoRBC\")","v":"NoRBC"}]
[null,"Sulfallate","95-06-7",{"$f":"IFERROR(VLOOKUP(C541,RBCs!$B$5:$C$265,2,FALSE),\"NoRBC\")","v":"NoRBC"}]
[null,"Sulfuric acid","7664-93-9"]
[null,"Sulfur mustard","505-60-2"]
[null,"Sulfur trioxide","7446-71-9"]
[null,"Talc containing asbestiform fibers","358",{"$f":"IFERROR(VLOOKUP(C545,RBCs!$B$5:$C$265,2,FALSE),\"NoRBC\")","v":"NoRBC"}]
[null,"Terephthalic acid","100-21-0",{"$f":"IFERROR(VLOOKUP(C546,RBCs!$B$5:$C$265,2,FALSE),\"NoRBC\")","v":"NoRBC"}]
[null,"Tetrabromodiphenyl ether","40088-47-9",{"$f":"IFERROR(VLOOKUP(C547,RBCs!$B$5:$C$265,2,FALSE),\"NoRBC\")","v":"NoRBC"}]
[null,"1,1,1,2-Tetrachloroethane","630-20-6"]
[null,"1,1,2,2-Tetrachloroethane","79-34-5"]
[null,"Tetrachloroethene (Perchloroethylene)","127-18-4"]
[null,"2,3,4,6-Tetrachlorophenol","58-90-2",{"$f":"IFERROR(VLOOKUP(C551,RBCs!$B$5:$C$265,2,FALSE),\"NoRBC\")","v":"NoRBC"}]
[null,"1,1,1,2-Tetrafluoroethane","811-97-2"]
[null,"Thallium and compounds","7440-28-0",{"$f":"IFERROR(VLOOKUP(C553,RBCs!$B$5:$C$265,2,FALSE),\"NoRBC\")","v":"NoRBC"}]
[null,"Thioacetamide","62-55-5"]
[null,"4,4-Thiodianiline","139-65-1",{"$f":"IFERROR(VLOOKUP(C555,RBCs!$B$5:$C$265,2,FALSE),\"NoRBC\")","v":"NoRBC"}]
[null,"Thiourea","62-56-6",{"$f":"IFERROR(VLOOKUP(C556,RBCs!$B$5:$C$265,2,FALSE),\"NoRBC\")","v":"NoRBC"}]
[null,"Titanium tetrachloride","7550-45-0"]
[null,"Toluene","108-88-3"]
[null,"Toluene diisocyanates (2,4- and 2,6-)","26471-62-5"]
[null,"Toluene-2,4-diisocyanate","584-84-9",{"$f":"IFERROR(VLOOKUP(C560,RBCs!$B$5:$C$265,2,FALSE),\"NoRBC\")","v":"NoRBC"}]
[null,"Toluene-2,6-diisocyanate","91-08-7",{"$f":"IFERROR(VLOOKUP(C561,RBCs!$B$5:$C$265,2,FALSE),\"NoRBC\")","v":"NoRBC"}]
[null,"o-Toluidine","95-53-4",{"$f":"IFERROR(VLOOKUP(C562,RBCs!$B$5:$C$265,2,FALSE),\"NoRBC\")","v":"NoRBC"}]
[null,"o-Toluidine hydrochloride","636-21-5",{"$f":"IFERROR(VLOOKUP(C563,RBCs!$B$5:$C$265,2,FALSE),\"NoRBC\")","v":"NoRBC"}]
[null,"Total Tetrachlorodibenzo-p-dioxin","41903-57-5",{"$f":"IFERROR(VLOOKUP(C564,RBCs!$B$5:$C$265,2,FALSE),\"NoRBC\")","v":"NoRBC"}]
[null,"Total Pentachlorodibenzo-p-dioxin","36088-22-9",{"$f":"IFERROR(VLOOKUP(C565,RBCs!$B$5:$C$265,2,FALSE),\"NoRBC\")","v":"NoRBC"}]
[null,"Total Hexachlorodibenzo-p-dioxin","34465-46-8",{"$f":"IFERROR(VLOOKUP(C566,RBCs!$B$5:$C$265,2,FALSE),\"NoRBC\")","v":"NoRBC"}]
[null,"Total Heptachlorodibenzo-p-dioxin","37871-00-4",{"$f":"IFERROR(VLOOKUP(C567,RBCs!$B$5:$C$265,2,FALSE),\"NoRBC\")","v":"NoRBC"}]
[null,"Total Tetrachlorodibenzofuran","55722-27-5",{"$f":"IFERROR(VLOOKUP(C568,RBCs!$B$5:$C$265,2,FALSE),\"NoRBC\")","v":"NoRBC"}]
[null,"Total Pentachlorodibenzofuran","30402-15-4",{"$f":"IFERROR(VLOOKUP(C569,RBCs!$B$5:$C$265,2,FALSE),\"NoRBC\")","v":"NoRBC"}]
[null,"Total Hexachlorodibenzofuran","55684-94-1",{"$f":"IFERROR(VLOOKUP(C570,RBCs!$B$5:$C$265,2,FALSE),\"NoRBC\")","v":"NoRBC"}]
[null,"Total Heptachlorodibenzofuran","38998-75-3",{"$f":"IFERROR(VLOOKUP(C571,RBCs!$B$5:$C$265,2,FALSE),\"NoRBC\")","v":"NoRBC"}]
[null,"Toxaphene (Polychlorinated camphenes)","8001-35-2"]
[null,"Tributyl phosphate","126-73-8",{"$f":"IFERROR(VLOOKUP(C573,RBCs!$B$5:$C$265,2,FALSE),\"NoRBC\")","v":"NoRBC"}]
[null,"1,2,4-Trichlorobenzene","120-82-1",{"$f":"IFERROR(VLOOKUP(C574,RBCs!$B$5:$C$265,2,FALSE),\"NoRBC\")","v":"NoRBC"}]
[null,"1,1,1-Trichloroethane (Methyl chloroform)","71-55-6"]
[null,"1,1,2-Trichloroethane (Vinyl trichloride)","79-00-5"]
[null,"Trichloroethene (TCE, Trichloroethylene)","79-01-6"]
[null,"Trichlorofluoromethane (Freon 11)","75-69-4",{"$f":"IFERROR(VLOOKUP(C578,RBCs!$B$5:$C$265,2,FALSE),\"NoRBC\")","v":"NoRBC"}]
[null,"2,4,5-Trichlorophenol","95-95-4",{"$f":"IFERROR(VLOOKUP(C579,RBCs!$B$5:$C$265,2,FALSE),\"NoRBC\")","v":"NoRBC"}]
[null,"2,4,6-Trichlorophenol","88-06-2"]
[null,"1,2,3-Trichloropropane","96-18-4"]
[null,"Triethyl phosphine","78-40-0",{"$f":"IFERROR(VLOOKUP(C582,RBCs!$B$5:$C$265,2,FALSE),\"NoRBC\")","v":"NoRBC"}]
[null,"Triethylamine","121-44-8"]
[null,"Triethylene glycol dimethyl ether","112-49-2",{"$f":"IFERROR(VLOOKUP(C584,RBCs!$B$5:$C$265,2,FALSE),\"NoRBC\")","v":"NoRBC"}]
[null,"Trimethyl phosphate","512-56-1",{"$f":"IFERROR(VLOOKUP(C585,RBCs!$B$5:$C$265,2,FALSE),\"NoRBC\")","v":"NoRBC"}]
[null,"Triorthocresyl phosphate","78-30-8",{"$f":"IFERROR(VLOOKUP(C586,RBCs!$B$5:$C$265,2,FALSE),\"NoRBC\")","v":"NoRBC"}]
[null,"Triphenyl phosphate","115-86-6",{"$f":"IFERROR(VLOOKUP(C587,RBCs!$B$5:$C$265,2,FALSE),\"NoRBC\")","v":"NoRBC"}]
[null,"Triphenyl phosphite","101-02-0",{"$f":"IFERROR(VLOOKUP(C588,RBCs!$B$5:$C$265,2,FALSE),\"NoRBC\")","v":"NoRBC"}]
[null,"Trifluralin","1582-09-8",{"$f":"IFERROR(VLOOKUP(C589,RBCs!$B$5:$C$265,2,FALSE),\"NoRBC\")","v":"NoRBC"}]
[null,"1,2,3-Trimethylbenzene","526-73-8"]
[null,"1,2,4-Trimethylbenzene","95-63-6"]
[null,"1,3,5-Trimethylbenzene","108-67-8"]
[null,"2,2,4-Trimethylpentane","540-84-1",{"$f":"IFERROR(VLOOKUP(C593,RBCs!$B$5:$C$265,2,FALSE),\"NoRBC\")","v":"NoRBC"}]
[null,"Tryptophan-P-1","62450-06-0",{"$f":"IFERROR(VLOOKUP(C594,RBCs!$B$5:$C$265,2,FALSE),\"NoRBC\")","v":"NoRBC"}]
[null,"Tryptophan-P-2","62450-07-1",{"$f":"IFERROR(VLOOKUP(C595,RBCs!$B$5:$C$265,2,FALSE),\"NoRBC\")","v":"NoRBC"}]
[null,"Urethane (Ethyl carbamate)","51-79-6"]
[null,"Vanadium (fume or dust)","7440-62-2"]
[null,"Vanadium pentoxide","1314-62-1"]
[null,"Vinyl acetate","108-05-4"]
[null,"Vinyl bromide","593-60-2"]
[null,"Vinyl chloride","75-01-4"]
[null,"4-Vinylcyclohexene","100-40-3",{"$f":"IFERROR(VLOOKUP(C602,RBCs!$B$5:$C$265,2,FALSE),\"NoRBC\")","v":"NoRBC"}]
[null,"Vinyl fluoride","75-02-5",{"$f":"IFERROR(VLOOKUP(C603,RBCs!$B$5:$C$265,2,FALSE),\"NoRBC\")","v":"NoRBC"}]
[null,"Vinylidene chloride","75-35-4"]
[null,"Xylene (mixture), including m-xylene, o-xylene, p-xylene","1330-20-7"]
[null,"m-Xylene","108-38-3",{"$f":"IFERROR(VLOOKUP(C606,RBCs!$B$5:$C$265,2,FALSE),\"NoRBC\")","v":"NoRBC"}]
[null,"o-Xylene","95-47-6",{"$f":"IFERROR(VLOOKUP(C607,RBCs!$B$5:$C$265,2,FALSE),\"NoRBC\")","v":"NoRBC"}]
[null,"p-Xylene","106-42-3",{"$f":"IFERROR(VLOOKUP(C608,RBCs!$B$5:$C$265,2,FALSE),\"NoRBC\")","v":"NoRBC"}]
[null,"Zinc and compounds","7440-66-6",{"$f":"IFERROR(VLOOKUP(C609,RBCs!$B$5:$C$265,2,FALSE),\"NoRBC\")","v":"NoRBC"}]
[null,"Zinc oxide","1314-13-2",{"$f":"IFERROR(VLOOKUP(C610,RBCs!$B$5:$C$265,2,FALSE),\"NoRBC\")","v":"NoRBC"}]

{"sheet":"Dispersion Factors","index":9,"n_rows":58,"n_cols":33,"rows_kept":58,"cut":false,"hidden":false,"merged":[[17,1,17,31],[0,1,0,31],[1,1,1,31],[2,1,2,31],[3,1,3,31],[4,6,4,31],[18,6,18,31],[31,1,31,32],[32,7,32,32],[45,1,45,32],[46,7,46,32]]}
[null,"OAR 340-245-8050 Table 5"]
[null,"Level 1 Risk Assessment Tool"]
[null,"Dispersion Factors"]
[null,"Table 5A: Stack Emission Dispersion Factors for Annual Exposure (µg/m3 / pounds/year)"]
[null,"Stack",null,null,null,null,"Exposure Location Distance (meters)"]
[null,"Ht (m)",10,20,30,40,50,60,70,80,90,100,110,120,130,140,150,160,170,180,190,200,250,300,350,400,450,500,600,700,800,1000]
[null,5,1.0999999999999999E-2,6.0000000000000001E-3,5.1999999999999998E-3,4.1000000000000003E-3,3.3E-3,2.5999999999999999E-3,2.0999999999999999E-3,1.6999999999999999E-3,1.4E-3,1.1999999999999999E-3,1E-3,8.8000000000000003E-4,7.6000000000000004E-4,6.6E-4,5.8E-4,5.1000000000000004E-4,4.6000000000000001E-4,4.0999999999999999E-4,3.6999999999999999E-4,3.4000000000000002E-4,2.3000000000000001E-4,1.7000000000000001E-4,1.2999999999999999E-4,1E-4,8.3999999999999995E-5,7.1000000000000005E-5,5.1999999999999997E-5,4.0000000000000003E-5,3.1999999999999999E-5,2.1999999999999999E-5]
[null,10,9.4999999999999998E-3,4.5999999999999999E-3,2.7000000000000001E-3,1.6000000000000001E-3,1.4E-3,1.1999999999999999E-3,1.1000000000000001E-3,9.3999999999999997E-4,8.4000000000000003E-4,7.5000000000000002E-4,6.8000000000000005E-4,6.2E-4,5.6999999999999998E-4,5.1999999999999995E-4,4.8000000000000001E-4,4.4000000000000002E-4,4.0999999999999999E-4,3.8000000000000002E-4,3.5E-4,3.3E-4,2.3000000000000001E-4,1.7000000000000001E-4,1.2999999999999999E-4,9.7999999999999997E-5,7.7999999999999999E-5,6.3999999999999997E-5,4.6999999999999997E-5,3.6000000000000001E-5,2.9E-5,2.0999999999999999E-5]
[null,15,4.3E-3,3.0000000000000001E-3,1.8E-3,1.2999999999999999E-3,7.5000000000000002E-4,6.0999999999999997E-4,5.4000000000000001E-4,4.8999999999999998E-4,4.4000000000000002E-4,4.0000000000000002E-4,3.6999999999999999E-4,3.4000000000000002E-4,3.1E-4,2.9E-4,2.7E-4,2.5000000000000001E-4,2.4000000000000001E-4,2.3000000000000001E-4,2.1000000000000001E-4,2.0000000000000001E-4,1.6000000000000001E-4,1.2999999999999999E-4,1E-4,8.2999999999999998E-5,6.8999999999999997E-5,5.7000000000000003E-5,4.1E-5,3.1999999999999999E-5,2.5000000000000001E-5,1.8E-5]
[null,20,2.3E-3,1.8E-3,1.2999999999999999E-3,8.8000000000000003E-4,7.2000000000000005E-4,5.4000000000000001E-4,3.5E-4,3.1E-4,2.7999999999999998E-4,2.5999999999999998E-4,2.3000000000000001E-4,2.2000000000000001E-4,2.0000000000000001E-4,1.9000000000000001E-4,1.7000000000000001E-4,1.6000000000000001E-4,1.4999999999999999E-4,1.3999999999999999E-4,1.3999999999999999E-4,1.2999999999999999E-4,1E-4,8.6000000000000003E-5,7.2999999999999999E-5,6.2000000000000003E-5,5.3000000000000001E-5,4.6E-5,3.4999999999999997E-5,2.6999999999999999E-5,2.0999999999999999E-5,1.5E-5]
[null,25,1.2999999999999999E-3,1.1000000000000001E-3,9.1E-4,6.6E-4,5.0000000000000001E-4,4.0999999999999999E-4,3.5E-4,2.5000000000000001E-4,1.9000000000000001E-4,1.8000000000000001E-4,1.6000000000000001E-4,1.4999999999999999E-4,1.3999999999999999E-4,1.2999999999999999E-4,1.2E-4,1.2E-4,1.1E-4,1E-4,9.6000000000000002E-5,9.1000000000000003E-5,7.2000000000000002E-5,5.8999999999999998E-5,5.1E-5,4.3999999999999999E-5,3.8999999999999999E-5,3.4E-5,2.6999999999999999E-5,2.1999999999999999E-5,1.8E-5,1.2999999999999999E-5]
[null,30,8.1999999999999998E-4,7.2999999999999996E-4,6.2E-4,5.0000000000000001E-4,3.6999999999999999E-4,2.9999999999999997E-4,2.5999999999999998E-4,2.3000000000000001E-4,1.9000000000000001E-4,1.2999999999999999E-4,1.2E-4,1.1E-4,1E-4,9.6000000000000002E-5,9.0000000000000006E-5,8.5000000000000006E-5,8.0000000000000007E-5,7.4999999999999993E-5,7.1000000000000005E-5,6.7999999999999999E-5,5.3000000000000001E-5,4.3999999999999999E-5,3.6999999999999998E-5,3.1999999999999999E-5,2.8E-5,2.5000000000000001E-5,2.0999999999999999E-5,1.7E-5,1.4E-5,1.0000000000000001E-5]
[null,35,5.2999999999999998E-4,4.8999999999999998E-4,4.2999999999999999E-4,3.6999999999999999E-4,2.9999999999999997E-4,2.3000000000000001E-4,1.9000000000000001E-4,1.7000000000000001E-4,1.4999999999999999E-4,1.2999999999999999E-4,1.1E-4,8.1000000000000004E-5,7.4999999999999993E-5,7.1000000000000005E-5,6.7999999999999999E-5,6.3999999999999997E-5,6.0999999999999999E-5,5.8E-5,5.5000000000000002E-5,5.1999999999999997E-5,4.1999999999999998E-5,3.4E-5,2.9E-5,2.5000000000000001E-5,2.1999999999999999E-5,1.9000000000000001E-5,1.5999999999999999E-5,1.4E-5,1.1E-5,8.4435308375617604E-6]
[null,40,3.6999999999999999E-4,3.4000000000000002E-4,3.1E-4,2.7E-4,2.3000000000000001E-4,1.9000000000000001E-4,1.4999999999999999E-4,1.2999999999999999E-4,1.2E-4,1.1E-4,9.6000000000000002E-5,8.1000000000000004E-5,6.3999999999999997E-5,5.3999999999999998E-5,5.1E-5,4.8999999999999998E-5,4.6999999999999997E-5,4.5000000000000003E-5,4.3000000000000002E-5,4.1E-5,3.3000000000000003E-5,2.8E-5,2.3E-5,2.0000000000000002E-5,1.8E-5,1.5999999999999999E-5,1.2999999999999999E-5,1.1E-5,9.3306957262908366E-6,7.0463861920172599E-6]
[null,45,2.7E-4,2.5000000000000001E-4,2.3000000000000001E-4,2.1000000000000001E-4,1.8000000000000001E-4,1.6000000000000001E-4,1.2999999999999999E-4,1.1E-4,9.5000000000000005E-5,8.5000000000000006E-5,7.7999999999999999E-5,7.2000000000000002E-5,6.3E-5,5.3000000000000001E-5,4.1999999999999998E-5,3.8000000000000002E-5,3.6999999999999998E-5,3.6000000000000001E-5,3.4E-5,3.3000000000000003E-5,2.6999999999999999E-5,2.3E-5,1.9000000000000001E-5,1.7E-5,1.5E-5,1.2999999999999999E-5,1.1E-5,8.9914292753738986E-6,7.8039420938378147E-6,5.9786441061701769E-6]
[null,50,1.9000000000000001E-4,1.8000000000000001E-4,1.7000000000000001E-4,1.6000000000000001E-4,1.3999999999999999E-4,1.2999999999999999E-4,1.1E-4,9.0000000000000006E-5,7.7000000000000001E-5,6.7999999999999999E-5,6.2000000000000003E-5,5.7000000000000003E-5,5.3000000000000001E-5,4.8000000000000001E-5,4.1999999999999998E-5,3.4999999999999997E-5,2.9E-5,2.6999999999999999E-5,2.5999999999999998E-5,2.5999999999999998E-5,2.1999999999999999E-5,1.9000000000000001E-5,1.5999999999999999E-5,1.4E-5,1.2E-5,1.1E-5,8.9063639511499987E-6,7.4923175782758662E-6,6.4878694048237376E-6,5.077207772317446E-6]
[]
[null,"Table 5B: Stack Emission Dispersion Factors for 24 hour Exposure (µg/m3 / pounds/day)"]
[null,"Stack",null,null,null,null,"Exposure Location Distance (meters)"]
[null,"Ht (m)",10,20,30,40,50,60,70,80,90,100,110,120,130,140,150,160,170,180,190,200,250,300,350,400,450,500,600,700,800,1000]
[null,5,27,13,12,9.6999999999999993,8.3000000000000007,7.1,6.1,5.2,4.4000000000000004,3.8,3.2,2.7,2.4,2.1,1.8,1.6,1.4,1.3,1.2,1.1000000000000001,0.72,0.55000000000000004,0.44,0.36,0.3,0.26,0.2,0.16,0.13,9.1999999999999998E-2]
[null,10,9.8000000000000007,8.8000000000000007,6.5,4.0999999999999996,3.8,3.4,3.1,2.8,2.6,2.4,2.2000000000000002,2.1,2,1.8,1.7,1.6,1.5,1.4,1.3,1.3,0.91,0.67,0.5,0.38,0.3,0.25,0.18,0.14000000000000001,0.12,8.7999999999999995E-2]
[null,15,3.3,3.7,3.4,3,1.8,1.6,1.6,1.5,1.4,1.3,1.2,1.1000000000000001,1.1000000000000001,1,0.95,0.91,0.87,0.83,0.8,0.77,0.64,0.53,0.43,0.36,0.3,0.25,0.18,0.13,0.1,7.4999999999999997E-2]
[null,20,1.6,1.9,1.8,1.7,1.6,1.3,0.91,0.86,0.82,0.77,0.73,0.69,0.65,0.62,0.59,0.56000000000000005,0.54,0.52,0.49,0.48,0.4,0.35,0.31,0.27,0.23,0.2,0.16,0.12,9.6000000000000002E-2,6.4000000000000001E-2]
[null,25,0.83,0.99,1.1000000000000001,1,0.97,0.93,0.85,0.64,0.52,0.5,0.48,0.46,0.44,0.42,0.4,0.38,0.36,0.35,0.34,0.32,0.27,0.23,0.21,0.19,0.17,0.15,0.12,0.1,8.2000000000000003E-2,5.7000000000000002E-2]
[null,30,0.49,0.56999999999999995,0.64,0.65,0.62,0.59,0.56999999999999995,0.55000000000000004,0.49,0.34,0.32,0.31,0.3,0.28999999999999998,0.28000000000000003,0.27,0.26,0.25,0.24,0.23,0.19,0.17,0.15,0.13,0.12,0.11,9.5000000000000001E-2,7.8E-2,6.6000000000000003E-2,4.8000000000000001E-2]
[null,35,0.31,0.35,0.4,0.42,0.42,0.41,0.39,0.38,0.37,0.34,0.28999999999999998,0.22,0.21,0.21,0.2,0.2,0.19,0.18,0.18,0.17,0.15,0.13,0.11,9.9000000000000005E-2,0.09,8.3000000000000004E-2,7.1999999999999995E-2,6.2E-2,5.2999999999999999E-2,0.04]
[null,40,0.21,0.24,0.27,0.28999999999999998,0.3,0.28999999999999998,0.28000000000000003,0.28000000000000003,0.27,0.26,0.25,0.22,0.17,0.15,0.15,0.15,0.14000000000000001,0.14000000000000001,0.14000000000000001,0.13,0.11,0.1,8.7999999999999995E-2,7.8E-2,7.0000000000000007E-2,6.4000000000000001E-2,5.6000000000000001E-2,4.9000000000000002E-2,4.3999999999999997E-2,3.3000000000000002E-2]
[null,45,0.15,0.17,0.19,0.21,0.22,0.22,0.21,0.21,0.2,0.2,0.19,0.19,0.17,0.16,0.12,0.11,0.11,0.11,0.11,0.1,9.1999999999999998E-2,8.1000000000000003E-2,7.1999999999999995E-2,6.5000000000000002E-2,5.8000000000000003E-2,5.2999999999999999E-2,4.4999999999999998E-2,0.04,3.5999999999999997E-2,2.8000000000000001E-2]
[null,50,0.11,0.12,0.14000000000000001,0.15,0.16,0.16,0.16,0.16,0.16,0.15,0.15,0.14000000000000001,0.14000000000000001,0.13,0.12,0.1,8.2000000000000003E-2,8.1000000000000003E-2,0.08,7.9000000000000001E-2,7.1999999999999995E-2,6.5000000000000002E-2,5.8999999999999997E-2,5.2999999999999999E-2,4.8000000000000001E-2,4.3999999999999997E-2,3.6999999999999998E-2,3.2000000000000001E-2,2.9000000000000001E-2,2.4E-2]
[]
[null,"Table 5C: Fugitive Emission Dispersion Factors for Annual Exposure (µg/m3 / pounds/year)"]
[null,"Building Area","Building",null,null,null,null,"Exposure Location Distance (meters)"]
[null,"(1,000 ft2)","Height (ft)",10,20,30,40,50,60,70,80,90,100,110,120,130,140,150,160,170,180,190,200,250,300,350,400,450,500,600,700,800,1000]
[{"$f":"B35&\"_\"&C35","v":"≤3_≤20"},"≤3","≤20",1.0999999999999999E-2,6.0000000000000001E-3,5.1999999999999998E-3,4.1000000000000003E-3,4.4999999999999997E-3,3.3E-3,2.5999999999999999E-3,2E-3,1.6999999999999999E-3,1.4E-3,1.1999999999999999E-3,1E-3,8.8999999999999995E-4,7.7999999999999999E-4,6.8999999999999997E-4,6.2E-4,5.5999999999999995E-4,5.0000000000000001E-4,4.6000000000000001E-4,4.2000000000000002E-4,2.9E-4,2.1000000000000001E-4,1.6000000000000001E-4,1.2999999999999999E-4,1E-4,8.7000000000000001E-5,6.3999999999999997E-5,4.8999999999999998E-5,3.8999999999999999E-5,2.6999999999999999E-5]
[{"$f":"B36&\"_\"&C36","v":">3 to 6_≤20"},">3 to 6","≤20",9.4999999999999998E-3,4.5999999999999999E-3,2.7000000000000001E-3,1.6000000000000001E-3,4.4000000000000003E-3,3.2000000000000002E-3,2.5000000000000001E-3,2E-3,1.6000000000000001E-3,1.4E-3,1.1999999999999999E-3,1E-3,8.8000000000000003E-4,7.6999999999999996E-4,6.8999999999999997E-4,6.0999999999999997E-4,5.5000000000000003E-4,5.0000000000000001E-4,4.6000000000000001E-4,4.2000000000000002E-4,2.7999999999999998E-4,2.1000000000000001E-4,1.6000000000000001E-4,1.2999999999999999E-4,1E-4,8.7000000000000001E-5,6.3999999999999997E-5,4.8999999999999998E-5,3.8999999999999999E-5,2.6999999999999999E-5]
[">3 to 6_>20",">3 to 6",">20",4.3E-3,3.0000000000000001E-3,1.8E-3,1.2999999999999999E-3,4.1000000000000003E-3,3.0999999999999999E-3,2.3999999999999998E-3,1.9E-3,1.6000000000000001E-3,1.2999999999999999E-3,1.1000000000000001E-3,9.7999999999999997E-4,8.5999999999999998E-4,7.6000000000000004E-4,6.7000000000000002E-4,5.9999999999999995E-4,5.4000000000000001E-4,4.8999999999999998E-4,4.4999999999999999E-4,4.0999999999999999E-4,2.7999999999999998E-4,2.1000000000000001E-4,1.6000000000000001E-4,1.2999999999999999E-4,1E-4,8.7000000000000001E-5,6.3999999999999997E-5,4.8999999999999998E-5,3.8999999999999999E-5,2.6999999999999999E-5]
[">6 to 10_≤20",">6 to 10","≤20",2.3E-3,1.8E-3,1.2999999999999999E-3,8.8000000000000003E-4,4.4000000000000003E-3,3.3E-3,2.5000000000000001E-3,2E-3,1.6999999999999999E-3,1.4E-3,1.1999999999999999E-3,1E-3,8.8000000000000003E-4,7.6999999999999996E-4,6.8999999999999997E-4,6.2E-4,5.5000000000000003E-4,5.0000000000000001E-4,4.6000000000000001E-4,4.2000000000000002E-4,2.7999999999999998E-4,2.1000000000000001E-4,1.6000000000000001E-4,1.2999999999999999E-4,1E-4,8.7000000000000001E-5,6.3999999999999997E-5,4.8999999999999998E-5,3.8999999999999999E-5,2.6999999999999999E-5]
[">6 to 10_>20",">6 to 10",">20",1.2999999999999999E-3,1.1000000000000001E-3,9.1E-4,6.6E-4,3.7000000000000002E-3,2.8E-3,2.2000000000000001E-3,1.8E-3,1.5E-3,1.2999999999999999E-3,1.1000000000000001E-3,9.5E-4,8.3000000000000001E-4,7.3999999999999999E-4,6.6E-4,5.9000000000000003E-4,5.2999999999999998E-4,4.8000000000000001E-4,4.4000000000000002E-4,4.0999999999999999E-4,2.7999999999999998E-4,2.0000000000000001E-4,1.6000000000000001E-4,1.2999999999999999E-4,1E-4,8.6000000000000003E-5,6.3999999999999997E-5,4.8999999999999998E-5,3.8999999999999999E-5,2.6999999999999999E-5]
[">10 to 15_≤20",">10 to 15","≤20",8.1999999999999998E-4,7.2999999999999996E-4,6.2E-4,5.0000000000000001E-4,4.4000000000000003E-3,3.3E-3,2.5000000000000001E-3,2E-3,1.6999999999999999E-3,1.4E-3,1.1999999999999999E-3,1E-3,8.8000000000000003E-4,7.6999999999999996E-4,6.8999999999999997E-4,6.2E-4,5.5000000000000003E-4,5.0000000000000001E-4,4.6000000000000001E-4,4.2000000000000002E-4,2.7999999999999998E-4,2.1000000000000001E-4,1.6000000000000001E-4,1.2999999999999999E-4,1E-4,8.7000000000000001E-5,6.3999999999999997E-5,4.8999999999999998E-5,3.8999999999999999E-5,2.6999999999999999E-5]
[">10 to 15_>20",">10 to 15",">20",5.2999999999999998E-4,4.8999999999999998E-4,4.2999999999999999E-4,3.6999999999999999E-4,3.3999999999999998E-3,2.7000000000000001E-3,2.0999999999999999E-3,1.8E-3,1.5E-3,1.1999999999999999E-3,1.1000000000000001E-3,9.3000000000000005E-4,8.0999999999999996E-4,7.2000000000000005E-4,6.4000000000000005E-4,5.8E-4,5.1999999999999995E-4,4.8000000000000001E-4,4.4000000000000002E-4,4.0000000000000002E-4,2.7999999999999998E-4,2.0000000000000001E-4,1.6000000000000001E-4,1.2E-4,1E-4,8.6000000000000003E-5,6.3E-5,4.8999999999999998E-5,3.8999999999999999E-5,2.6999999999999999E-5]
[">15 to 30_≤20",">15 to 30","≤20",3.6999999999999999E-4,3.4000000000000002E-4,3.1E-4,2.7E-4,4.3E-3,3.2000000000000002E-3,2.5000000000000001E-3,2E-3,1.6000000000000001E-3,1.4E-3,1.1999999999999999E-3,1E-3,8.8000000000000003E-4,7.6999999999999996E-4,6.8999999999999997E-4,6.0999999999999997E-4,5.5000000000000003E-4,5.0000000000000001E-4,4.6000000000000001E-4,4.2000000000000002E-4,2.7999999999999998E-4,2.1000000000000001E-4,1.6000000000000001E-4,1.2999999999999999E-4,1E-4,8.7000000000000001E-5,6.3999999999999997E-5,4.8999999999999998E-5,3.8999999999999999E-5,2.6999999999999999E-5]
[">15 to 30_>20",">15 to 30",">20",2.7E-4,2.5000000000000001E-4,2.3000000000000001E-4,2.1000000000000001E-4,3.3999999999999998E-3,2.7000000000000001E-3,2.0999999999999999E-3,1.8E-3,1.5E-3,1.1999999999999999E-3,1.1000000000000001E-3,9.3000000000000005E-4,8.1999999999999998E-4,7.2000000000000005E-4,6.4999999999999997E-4,5.8E-4,5.1999999999999995E-4,4.8000000000000001E-4,4.4000000000000002E-4,4.0000000000000002E-4,2.7999999999999998E-4,2.0000000000000001E-4,1.6000000000000001E-4,1.2999999999999999E-4,1E-4,8.6000000000000003E-5,6.3E-5,4.8999999999999998E-5,3.8999999999999999E-5,2.6999999999999999E-5]
[">30_>20",">30",">20",1.9000000000000001E-4,1.8000000000000001E-4,1.7000000000000001E-4,1.6000000000000001E-4,2.2000000000000001E-3,1.8E-3,1.5E-3,1.2999999999999999E-3,1.1000000000000001E-3,9.7999999999999997E-4,8.5999999999999998E-4,7.6000000000000004E-4,6.8000000000000005E-4,6.0999999999999997E-4,5.5000000000000003E-4,5.0000000000000001E-4,4.6000000000000001E-4,4.2000000000000002E-4,3.8999999999999999E-4,3.6000000000000002E-4,2.5000000000000001E-4,1.9000000000000001E-4,1.4999999999999999E-4,1.2E-4,9.7999999999999997E-5,8.2999999999999998E-5,6.0999999999999999E-5,4.8000000000000001E-5,3.8000000000000002E-5,2.6999999999999999E-5]
[]
[null,"Table 5D: Fugitive Emission Dispersion Factors for 24 hour Exposure (µg/m3 / pounds/day)"]
[null,"Building Area","Building",null,null,null,null,"Exposure Location Distance (meters)"]
[null,"(1,000 ft2)","Height (ft)",10,20,30,40,50,60,70,80,90,100,110,120,130,140,150,160,170,180,190,200,250,300,350,400,450,500,600,700,800,1000]
[{"$f":"B49&\"_\"&C49","v":"≤3_≤20"},"≤3","≤20",1.0999999999999999E-2,6.0000000000000001E-3,5.1999999999999998E-3,4.1000000000000003E-3,4.8,3.7,2.9,2.4,2,1.7,1.4,1.2,1.1000000000000001,0.97,0.87,0.78,0.71,0.65,0.59,0.55000000000000004,0.38,0.28999999999999998,0.22,0.18,0.15,0.13,9.5000000000000001E-2,7.3999999999999996E-2,0.06,4.2999999999999997E-2]
[{"$f":"B50&\"_\"&C50","v":">3 to 6_≤20"},">3 to 6","≤20",9.4999999999999998E-3,4.5999999999999999E-3,2.7000000000000001E-3,1.6000000000000001E-3,4.0999999999999996,3.1,2.5,2,1.7,1.4,1.2,1.1000000000000001,0.95,0.84,0.76,0.68,0.62,0.56999999999999995,0.52,0.48,0.33,0.25,0.2,0.16,0.13,0.11,8.3000000000000004E-2,6.5000000000000002E-2,5.2999999999999999E-2,3.7999999999999999E-2]
[">3 to 6_>20",">3 to 6",">20",4.3E-3,3.0000000000000001E-3,1.8E-3,1.2999999999999999E-3,3.5,2.8,2.2000000000000002,1.9,1.6,1.3,1.2,1,0.9,0.8,0.72,0.65,0.59,0.54,0.5,0.46,0.32,0.24,0.19,0.15,0.13,0.11,8.1000000000000003E-2,6.4000000000000001E-2,5.1999999999999998E-2,3.6999999999999998E-2]
[">6 to 10_≤20",">6 to 10","≤20",2.3E-3,1.8E-3,1.2999999999999999E-3,8.8000000000000003E-4,4,3.1,2.5,2,1.7,1.4,1.2,1.1000000000000001,0.94,0.84,0.75,0.68,0.62,0.56000000000000005,0.52,0.48,0.33,0.25,0.2,0.16,0.13,0.11,8.3000000000000004E-2,6.5000000000000002E-2,5.2999999999999999E-2,3.7999999999999999E-2]
[">6 to 10_>20",">6 to 10",">20",1.2999999999999999E-3,1.1000000000000001E-3,9.1E-4,6.6E-4,3.3,2.6,2.1,1.8,1.5,1.3,1.1000000000000001,0.97,0.86,0.77,0.69,0.63,0.56999999999999995,0.53,0.48,0.45,0.31,0.24,0.19,0.15,0.12,0.11,0.08,6.3E-2,5.0999999999999997E-2,3.5999999999999997E-2]
[">10 to 15_≤20",">10 to 15","≤20",8.1999999999999998E-4,7.2999999999999996E-4,6.2E-4,5.0000000000000001E-4,4,3.1,2.4,2,1.7,1.4,1.2,1.1000000000000001,0.94,0.84,0.75,0.68,0.62,0.56000000000000005,0.52,0.48,0.33,0.25,0.19,0.16,0.13,0.11,8.3000000000000004E-2,6.5000000000000002E-2,5.2999999999999999E-2,3.7999999999999999E-2]
[">10 to 15_>20",">10 to 15",">20",5.2999999999999998E-4,4.8999999999999998E-4,4.2999999999999999E-4,3.6999999999999999E-4,2.9,2.4,2,1.6,1.4,1.2,1.1000000000000001,0.93,0.83,0.74,0.67,0.61,0.56000000000000005,0.51,0.47,0.43,0.31,0.23,0.18,0.15,0.12,0.1,7.8E-2,6.2E-2,0.05,3.5000000000000003E-2]
[">15 to 30_≤20",">15 to 30","≤20",3.6999999999999999E-4,3.4000000000000002E-4,3.1E-4,2.7E-4,3.7,2.9,2.2999999999999998,1.9,1.6,1.4,1.2,1,0.92,0.82,0.74,0.67,0.61,0.55000000000000004,0.51,0.47,0.33,0.25,0.19,0.16,0.13,0.11,8.3000000000000004E-2,6.5000000000000002E-2,5.2999999999999999E-2,3.6999999999999998E-2]
[">15 to 30_>20",">15 to 30",">20",2.7E-4,2.5000000000000001E-4,2.3000000000000001E-4,2.1000000000000001E-4,2.9,2.2999999999999998,1.9,1.6,1.4,1.2,1,0.92,0.82,0.74,0.67,0.6,0.55000000000000004,0.51,0.47,0.43,0.31,0.23,0.18,0.15,0.12,0.1,7.8E-2,6.2E-2,0.05,3.5000000000000003E-2]
[">30_>20",">30",">20",1.9000000000000001E-4,1.8000000000000001E-4,1.7000000000000001E-4,1.6000000000000001E-4,1.8,1.5,1.3,1.2,1,0.92,0.82,0.73,0.66,0.6,0.55000000000000004,0.51,0.47,0.43,0.4,0.37,0.27,0.21,0.17,0.14000000000000001,0.12,9.8000000000000004E-2,7.4999999999999997E-2,5.8999999999999997E-2,4.8000000000000001E-2,3.4000000000000002E-2]

{"sheet":"Errata","index":10,"n_rows":4,"n_cols":1,"rows_kept":4,"cut":false,"hidden":false,"merged":[]}
[]
[]
["11/12/21 - Modified zinc and nickel emission rates - parent metal only"]
["11/12/21 - Changed \"Nickel and Compounds\" to nickel compounds, soluble"]